null
SMILES: Fc1ccc(NS(=O)(=O)c2cccnc2)c(F)c1C#Cc1cnc2[nH]nc(C3CC3)c2c1
InChI Key: InChIKey=QHFQFWYLROSXCZ-UHFFFAOYSA-N
Activity Spreadsheet -- Enzyme Inhibition Constant Data from BindingDB
Found 1 hit for monomerid = 50091819
Trg + Lig
Ki
nM
ΔG°
kcal/mole
IC50
nM
Kd
nM
EC50/IC50
nM
koff
s-1
kon
M-1s-1
pHTemp
°C
Serine/threonine-protein kinase B-raf
(Homo sapiens (Human))
BDBM50091819
(CHEMBL3582394)
Show SMILES Fc1ccc(NS(=O)(=O)c2cccnc2)c(F)c1C#Cc1cnc2[nH]nc(C3CC3)c2c1
Show InChI InChI=1S/C22H15F2N5O2S/c23-18-7-8-19(29-32(30,31)15-2-1-9-25-12-15)20(24)16(18)6-3-13-10-17-21(14-4-5-14)27-28-22(17)26-11-13/h1-2,7-12,14,29H,4-5H2,(H,26,27,28)
NCI pathway
Reactome pathway
n/an/a 10n/an/an/an/an/an/a
Guangzhou Institutes of Biomedicine and Health
Curated by ChEMBL
Assay Description
Inhibition of human recombinant B-Raf V600E mutant by FRET-based Z'-lyte assay
ACS Med Chem Lett 6: 543-7 (2015)
Article DOI: 10.1021/acsmedchemlett.5b00039
BindingDB Entry DOI: 10.7270/Q26W9CT5