BDBM50091821 (R)-9-Chloro-2,3,4,4a-tetrahydro-1H,6H-pyrazino[1,2-a]quinoxalin-5-one::CHEMBL59631
SMILES: Clc1ccc2NC(=O)[C@H]3CNCCN3c2c1
InChI Key: InChIKey=DMKXWGJIDPBMPT-SNVBAGLBSA-N
Data: 2 KI  1 EC50
Activity Spreadsheet -- Enzyme Inhibition Constant Data from BindingDB
Found 3 hits for monomerid = 50091821
Trg + Lig
Ki
nM
ΔG°
kcal/mole
IC50
nM
Kd
nM
EC50/IC50
nM
koff
s-1
kon
M-1s-1
pHTemp
°C
5-hydroxytryptamine receptor 2C
(Homo sapiens (Human))
BDBM50091821
((R)-9-Chloro-2,3,4,4a-tetrahydro-1H,6H-pyrazino[1,...)
Show SMILES Clc1ccc2NC(=O)[C@H]3CNCCN3c2c1
Show InChI InChI=1S/C11H12ClN3O/c12-7-1-2-8-9(5-7)15-4-3-13-6-10(15)11(16)14-8/h1-2,5,10,13H,3-4,6H2,(H,14,16)/t10-/m1/s1
Reactome pathway
34n/an/an/an/an/an/an/an/a
Wyeth-Ayerst Research
Curated by ChEMBL
Assay Description
Binding affinity using [3H]-mesulergine as radioligand with receptor membranes isolated from a CHO-k cell line expressing the human 5-hydroxytryptami...
Bioorg Med Chem Lett 10: 1991-4 (2001)
BindingDB Entry DOI: 10.7270/Q2Z89BMP
5-hydroxytryptamine receptor 2C
(Homo sapiens (Human))
BDBM50091821
((R)-9-Chloro-2,3,4,4a-tetrahydro-1H,6H-pyrazino[1,...)
Show SMILES Clc1ccc2NC(=O)[C@H]3CNCCN3c2c1
Show InChI InChI=1S/C11H12ClN3O/c12-7-1-2-8-9(5-7)15-4-3-13-6-10(15)11(16)14-8/h1-2,5,10,13H,3-4,6H2,(H,14,16)/t10-/m1/s1
Reactome pathway
238n/an/an/an/an/an/an/an/a
Wyeth-Ayerst Research
Curated by ChEMBL
Assay Description
Binding affinity using [3H]-mesulergine as radioligand with receptor membranes isolated from a CHO-k cell line expressing the human 5-hydroxytryptami...
Bioorg Med Chem Lett 10: 1991-4 (2001)
BindingDB Entry DOI: 10.7270/Q2Z89BMP
5-hydroxytryptamine receptor 2C
(Homo sapiens (Human))
BDBM50091821
((R)-9-Chloro-2,3,4,4a-tetrahydro-1H,6H-pyrazino[1,...)
Show SMILES Clc1ccc2NC(=O)[C@H]3CNCCN3c2c1
Show InChI InChI=1S/C11H12ClN3O/c12-7-1-2-8-9(5-7)15-4-3-13-6-10(15)11(16)14-8/h1-2,5,10,13H,3-4,6H2,(H,14,16)/t10-/m1/s1
Reactome pathway
n/an/an/an/a 86n/an/an/an/a
Wyeth-Ayerst Research
Curated by ChEMBL
Assay Description
Agonistic activity for 5-HT2c (5-HT2C) by measuring [3H]-inositol monophosphate fromation in CHO cells in which the human 5-HT2C receptor subtype was...
Bioorg Med Chem Lett 10: 1991-4 (2001)
BindingDB Entry DOI: 10.7270/Q2Z89BMP