BDBM50091827 (S)-8,9-Dichloro-2,3,4,4a-tetrahydro-1H,6H-pyrazino[1,2-a]quinoxalin-5-one::CHEMBL60830
SMILES: Clc1cc2NC(=O)[C@@H]3CNCCN3c2cc1Cl
InChI Key: InChIKey=PHGWDAICBXUJDU-JTQLQIEISA-N
Data: 2 KI  1 EC50
Activity Spreadsheet -- Enzyme Inhibition Constant Data from BindingDB
Found 3 hits for monomerid = 50091827
Trg + Lig
Ki
nM
ΔG°
kcal/mole
IC50
nM
Kd
nM
EC50/IC50
nM
koff
s-1
kon
M-1s-1
pHTemp
°C
5-hydroxytryptamine receptor 2C
(Homo sapiens (Human))
BDBM50091827
((S)-8,9-Dichloro-2,3,4,4a-tetrahydro-1H,6H-pyrazin...)
Show SMILES Clc1cc2NC(=O)[C@@H]3CNCCN3c2cc1Cl
Show InChI InChI=1S/C11H11Cl2N3O/c12-6-3-8-9(4-7(6)13)16-2-1-14-5-10(16)11(17)15-8/h3-4,10,14H,1-2,5H2,(H,15,17)/t10-/m0/s1
Reactome pathway
66n/an/an/an/an/an/an/an/a
Wyeth-Ayerst Research
Curated by ChEMBL
Assay Description
Binding affinity using [125I]-DOI as radioligand with membranes isolated from a CHO-k cell line expressing the human 5-hydroxytryptamine 2C receptor
Bioorg Med Chem Lett 10: 1991-4 (2001)
BindingDB Entry DOI: 10.7270/Q2Z89BMP
5-hydroxytryptamine receptor 2C
(Homo sapiens (Human))
BDBM50091827
((S)-8,9-Dichloro-2,3,4,4a-tetrahydro-1H,6H-pyrazin...)
Show SMILES Clc1cc2NC(=O)[C@@H]3CNCCN3c2cc1Cl
Show InChI InChI=1S/C11H11Cl2N3O/c12-6-3-8-9(4-7(6)13)16-2-1-14-5-10(16)11(17)15-8/h3-4,10,14H,1-2,5H2,(H,15,17)/t10-/m0/s1
Reactome pathway
285n/an/an/an/an/an/an/an/a
Wyeth-Ayerst Research
Curated by ChEMBL
Assay Description
Agonistic activity for 5-HT2c (5-HT2C) by measuring [3H]-inositol monophosphate fromation in CHO cells in which the human 5-HT2C receptor subtype was...
Bioorg Med Chem Lett 10: 1991-4 (2001)
BindingDB Entry DOI: 10.7270/Q2Z89BMP
5-hydroxytryptamine receptor 2C
(Homo sapiens (Human))
BDBM50091827
((S)-8,9-Dichloro-2,3,4,4a-tetrahydro-1H,6H-pyrazin...)
Show SMILES Clc1cc2NC(=O)[C@@H]3CNCCN3c2cc1Cl
Show InChI InChI=1S/C11H11Cl2N3O/c12-6-3-8-9(4-7(6)13)16-2-1-14-5-10(16)11(17)15-8/h3-4,10,14H,1-2,5H2,(H,15,17)/t10-/m0/s1
Reactome pathway
n/an/an/an/a 290n/an/an/an/a
Wyeth-Ayerst Research
Curated by ChEMBL
Assay Description
Agonistic activity for 5-HT2c (5-HT2C) by measuring [3H]-inositol monophosphate fromation in CHO cells in which the human 5-HT2C receptor subtype was...
Bioorg Med Chem Lett 10: 1991-4 (2001)
BindingDB Entry DOI: 10.7270/Q2Z89BMP