BDBM50091973 1-(5-Chloro-pyridin-2-yl)-3-((S)-1-cyclohexyl-ethyl)-thiourea::CHEMBL416876::HI-510
SMILES: C[C@H](NC(=S)Nc1ccc(Cl)cn1)C1CCCCC1
InChI Key: InChIKey=OLDOVNHRYKANBI-JTQLQIEISA-N
Data: 1 KI  1 IC50
Activity Spreadsheet -- Enzyme Inhibition Constant Data from BindingDB
Found 2 hits for monomerid = 50091973
Trg + Lig
Ki
nM
ΔG°
kcal/mole
IC50
nM
Kd
nM
EC50/IC50
nM
koff
s-1
kon
M-1s-1
pHTemp
°C
Human immunodeficiency virus type 1 reverse transcriptase
(Human immunodeficiency virus 1)
BDBM50091973
(1-(5-Chloro-pyridin-2-yl)-3-((S)-1-cyclohexyl-ethy...)
Show SMILES C[C@H](NC(=S)Nc1ccc(Cl)cn1)C1CCCCC1
Show InChI InChI=1S/C14H20ClN3S/c1-10(11-5-3-2-4-6-11)17-14(19)18-13-8-7-12(15)9-16-13/h7-11H,2-6H2,1H3,(H2,16,17,18,19)/t10-/m0/s1
>1.00E+5n/an/an/an/an/an/an/an/a
Institute
Curated by ChEMBL
Assay Description
Binding affinity against HIV reverse transcriptase (Estimated Ki)
Bioorg Med Chem Lett 10: 2071-4 (2000)
BindingDB Entry DOI: 10.7270/Q2668DQZ
Human immunodeficiency virus type 1 reverse transcriptase
(Human immunodeficiency virus 1)
BDBM50091973
(1-(5-Chloro-pyridin-2-yl)-3-((S)-1-cyclohexyl-ethy...)
Show SMILES C[C@H](NC(=S)Nc1ccc(Cl)cn1)C1CCCCC1
Show InChI InChI=1S/C14H20ClN3S/c1-10(11-5-3-2-4-6-11)17-14(19)18-13-8-7-12(15)9-16-13/h7-11H,2-6H2,1H3,(H2,16,17,18,19)/t10-/m0/s1
n/an/a>1.00E+5n/an/an/an/an/an/a
Institute
Curated by ChEMBL
Assay Description
Compound was evaluated for its inhibitory activity against recombinant HIV-1 Reverse transcriptase using cell free RT inhibition assay
Bioorg Med Chem Lett 10: 2071-4 (2000)
BindingDB Entry DOI: 10.7270/Q2668DQZ