BDBM50092 2-(7-Methyl-4-oxo-1,2,3,4-tetrahydro-cyclopenta[c]chromen-9-yloxy)-N-(5-methyl-2-p-tolyl-2H-pyrazol-3- yl)-acetamide::2-[(4-keto-7-methyl-2,3-dihydro-1H-cyclopenta[c]chromen-9-yl)oxy]-N-[5-methyl-2-(p-tolyl)pyrazol-3-yl]acetamide::MLS000558572::N-[5-methyl-2-(4-methylphenyl)-3-pyrazolyl]-2-[(7-methyl-4-oxo-2,3-dihydro-1H-cyclopenta[c][1]benzopyran-9-yl)oxy]acetamide::N-[5-methyl-2-(4-methylphenyl)pyrazol-3-yl]-2-[(7-methyl-4-oxidanylidene-2,3-dihydro-1H-cyclopenta[c]chromen-9-yl)oxy]ethanamide::N-[5-methyl-2-(4-methylphenyl)pyrazol-3-yl]-2-[(7-methyl-4-oxo-2,3-dihydro-1H-cyclopenta[c]chromen-9-yl)oxy]acetamide::SMR000149088::cid_1979096
SMILES: Cc1cc(NC(=O)COc2cc(C)cc3oc(=O)c4CCCc4c23)n(n1)-c1ccc(C)cc1
InChI Key: InChIKey=UZSRYNVWOXCPDV-UHFFFAOYSA-N
Data: 1 IC50
Activity Spreadsheet -- Enzyme Inhibition Constant Data from BindingDB
Found 1 hit for monomerid = 50092
Trg + Lig
Ki
nM
ΔG°
kcal/mole
IC50
nM
Kd
nM
EC50/IC50
nM
koff
s-1
kon
M-1s-1
pHTemp
°C
Induced myeloid leukemia cell differentiation protein Mcl-1
(Homo sapiens (Human))
BDBM50092
(2-(7-Methyl-4-oxo-1,2,3,4-tetrahydro-cyclopenta[c]...)
Show SMILES Cc1cc(NC(=O)COc2cc(C)cc3oc(=O)c4CCCc4c23)n(n1)-c1ccc(C)cc1
Show InChI InChI=1S/C26H25N3O4/c1-15-7-9-18(10-8-15)29-23(13-17(3)28-29)27-24(30)14-32-21-11-16(2)12-22-25(21)19-5-4-6-20(19)26(31)33-22/h7-13H,4-6,14H2,1-3H3,(H,27,30)
NCI pathway
PCBioAssay
n/an/a 400n/an/an/an/an/an/a
Emory University Molecular Libraries Screening Center
Curated by PubChem BioAssay
Assay Description
NIH Molecular Libraries Screening Centers Network [MLSCN] Emory Chemical Biology Discovery Center in MLSCN Assay provider: Nikolovska-Coleska, Univer...
PubChem Bioassay (2008)
BindingDB Entry DOI: 10.7270/Q23X8539