BDBM50092153 CHEMBL3582478
SMILES: CC(C)(O)c1cncc(c1)-c1nc2ccc(F)cc2n1C1CC1
InChI Key: InChIKey=PRDAIONOCJACSU-NWDRRHQHSA-N
Data: 8 IC50
Activity Spreadsheet -- Enzyme Inhibition Constant Data from BindingDB
Found 8 hits for monomerid = 50092153
Trg + Lig
Ki
nM
ΔG°
kcal/mole
IC50
nM
Kd
nM
EC50/IC50
nM
koff
s-1
kon
M-1s-1
pHTemp
°C
Cytochrome P450 3A4
(Homo sapiens (Human))
BDBM50092153
(CHEMBL3582478)
Show SMILES CC(C)(O)c1cncc(c1)-c1nc2ccc(F)cc2n1C1CC1
Show InChI InChI=1S/C43H54N6O6/c1-5-28(4)39-42(53)44-22-11-23-55-32-19-16-30(17-20-32)25-36(41(52)49-39)45-26-37(50)35(24-29-12-7-6-8-13-29)47-43(54)38(27(2)3)48-40(51)34-21-18-31-14-9-10-15-33(31)46-34/h6-10,12-21,27-28,35-39,45,50H,5,11,22-26H2,1-4H3,(H,44,53)(H,47,54)(H,48,51)(H,49,52)/t28?,35-,36-,37+,38-,39-/m0/s1
Reactome pathway
n/an/a>5.00E+4n/an/an/an/an/an/a
Merck Research Laboratories
Curated by ChEMBL
Assay Description
Inhibition of CYP3A4 (unknown origin)
ACS Med Chem Lett 6: 573-8 (2015)
Article DOI: 10.1021/acsmedchemlett.5b00054
BindingDB Entry DOI: 10.7270/Q2K64KT8
Cytochrome P450 17A1
(Homo sapiens (Human))
BDBM50092153
(CHEMBL3582478)
Show SMILES CC(C)(O)c1cncc(c1)-c1nc2ccc(F)cc2n1C1CC1
Show InChI InChI=1S/C43H54N6O6/c1-5-28(4)39-42(53)44-22-11-23-55-32-19-16-30(17-20-32)25-36(41(52)49-39)45-26-37(50)35(24-29-12-7-6-8-13-29)47-43(54)38(27(2)3)48-40(51)34-21-18-31-14-9-10-15-33(31)46-34/h6-10,12-21,27-28,35-39,45,50H,5,11,22-26H2,1-4H3,(H,44,53)(H,47,54)(H,48,51)(H,49,52)/t28?,35-,36-,37+,38-,39-/m0/s1
Reactome pathway
n/an/a>1.00E+4n/an/an/an/an/an/a
Merck Research Laboratories
Curated by ChEMBL
Assay Description
Inhibition of human CYP17 expressed in COS7 cells incubated for 1 hr before 17-hydroxypregnenolone substrate addition by EIA method
ACS Med Chem Lett 6: 573-8 (2015)
Article DOI: 10.1021/acsmedchemlett.5b00054
BindingDB Entry DOI: 10.7270/Q2K64KT8
Cytochrome P450 19A1
(Homo sapiens (Human))
BDBM50092153
(CHEMBL3582478)
Show SMILES CC(C)(O)c1cncc(c1)-c1nc2ccc(F)cc2n1C1CC1
Show InChI InChI=1S/C43H54N6O6/c1-5-28(4)39-42(53)44-22-11-23-55-32-19-16-30(17-20-32)25-36(41(52)49-39)45-26-37(50)35(24-29-12-7-6-8-13-29)47-43(54)38(27(2)3)48-40(51)34-21-18-31-14-9-10-15-33(31)46-34/h6-10,12-21,27-28,35-39,45,50H,5,11,22-26H2,1-4H3,(H,44,53)(H,47,54)(H,48,51)(H,49,52)/t28?,35-,36-,37+,38-,39-/m0/s1
Reactome pathway
n/an/a 1.02E+3n/an/an/an/an/an/a
Merck Research Laboratories
Curated by ChEMBL
Assay Description
Inhibition of CYP19 (unknown origin) using MFC substrate incubated for 30 mins
ACS Med Chem Lett 6: 573-8 (2015)
Article DOI: 10.1021/acsmedchemlett.5b00054
BindingDB Entry DOI: 10.7270/Q2K64KT8
Cytochrome P450 11B1, mitochondrial
(Homo sapiens (Human))
BDBM50092153
(CHEMBL3582478)
Show SMILES CC(C)(O)c1cncc(c1)-c1nc2ccc(F)cc2n1C1CC1
Show InChI InChI=1S/C43H54N6O6/c1-5-28(4)39-42(53)44-22-11-23-55-32-19-16-30(17-20-32)25-36(41(52)49-39)45-26-37(50)35(24-29-12-7-6-8-13-29)47-43(54)38(27(2)3)48-40(51)34-21-18-31-14-9-10-15-33(31)46-34/h6-10,12-21,27-28,35-39,45,50H,5,11,22-26H2,1-4H3,(H,44,53)(H,47,54)(H,48,51)(H,49,52)/t28?,35-,36-,37+,38-,39-/m0/s1
n/an/a 100n/an/an/an/an/an/a
Merck USA
Curated by ChEMBL
Assay Description
Inhibition of human CYP11B1-8C7 expressed in Chinese hamster V79 cells using 11-deoxycortisol as substrate preincubated for 1 hr followed by substrat...
Bioorg Med Chem Lett 27: 143-146 (2017)
Article DOI: 10.1016/j.bmcl.2016.12.003
BindingDB Entry DOI: 10.7270/Q20K2BK0
Cytochrome P450 11B1, mitochondrial
(Homo sapiens (Human))
BDBM50092153
(CHEMBL3582478)
Show SMILES CC(C)(O)c1cncc(c1)-c1nc2ccc(F)cc2n1C1CC1
Show InChI InChI=1S/C43H54N6O6/c1-5-28(4)39-42(53)44-22-11-23-55-32-19-16-30(17-20-32)25-36(41(52)49-39)45-26-37(50)35(24-29-12-7-6-8-13-29)47-43(54)38(27(2)3)48-40(51)34-21-18-31-14-9-10-15-33(31)46-34/h6-10,12-21,27-28,35-39,45,50H,5,11,22-26H2,1-4H3,(H,44,53)(H,47,54)(H,48,51)(H,49,52)/t28?,35-,36-,37+,38-,39-/m0/s1
n/an/a 142n/an/an/an/an/an/a
Merck Research Laboratories
Curated by ChEMBL
Assay Description
Inhibition of human CYP11B1 expressed in V79 cells incubated for 1 hr before 11-deoxycortisol substrate addition by HTRF-based assay
ACS Med Chem Lett 6: 573-8 (2015)
Article DOI: 10.1021/acsmedchemlett.5b00054
BindingDB Entry DOI: 10.7270/Q2K64KT8
Cytochrome P450 11B2 (CYP11B2)
(Homo sapiens (Human))
BDBM50092153
(CHEMBL3582478)
Show SMILES CC(C)(O)c1cncc(c1)-c1nc2ccc(F)cc2n1C1CC1
Show InChI InChI=1S/C43H54N6O6/c1-5-28(4)39-42(53)44-22-11-23-55-32-19-16-30(17-20-32)25-36(41(52)49-39)45-26-37(50)35(24-29-12-7-6-8-13-29)47-43(54)38(27(2)3)48-40(51)34-21-18-31-14-9-10-15-33(31)46-34/h6-10,12-21,27-28,35-39,45,50H,5,11,22-26H2,1-4H3,(H,44,53)(H,47,54)(H,48,51)(H,49,52)/t28?,35-,36-,37+,38-,39-/m0/s1
n/an/a 2.30n/an/an/an/an/an/a
Merck Research Laboratories
Curated by ChEMBL
Assay Description
Inhibition of human CYP11B2 expressed in V79 cells incubated for 1 hr before 11-deoxycorticosterone substrate addition by HTRF-based assay
ACS Med Chem Lett 6: 573-8 (2015)
Article DOI: 10.1021/acsmedchemlett.5b00054
BindingDB Entry DOI: 10.7270/Q2K64KT8
Cytochrome P450 11B2 (CYP11B2)
(Homo sapiens (Human))
BDBM50092153
(CHEMBL3582478)
Show SMILES CC(C)(O)c1cncc(c1)-c1nc2ccc(F)cc2n1C1CC1
Show InChI InChI=1S/C43H54N6O6/c1-5-28(4)39-42(53)44-22-11-23-55-32-19-16-30(17-20-32)25-36(41(52)49-39)45-26-37(50)35(24-29-12-7-6-8-13-29)47-43(54)38(27(2)3)48-40(51)34-21-18-31-14-9-10-15-33(31)46-34/h6-10,12-21,27-28,35-39,45,50H,5,11,22-26H2,1-4H3,(H,44,53)(H,47,54)(H,48,51)(H,49,52)/t28?,35-,36-,37+,38-,39-/m0/s1
n/an/a 1.40n/an/an/an/an/an/a
Merck USA
Curated by ChEMBL
Assay Description
Inhibition of human CYP11B2-CLE9 expressed in Chinese hamster V79 cells using 11-deoxycorticosterone as substrate preincubated for 1 hr followed by s...
Bioorg Med Chem Lett 27: 143-146 (2017)
Article DOI: 10.1016/j.bmcl.2016.12.003
BindingDB Entry DOI: 10.7270/Q20K2BK0
Cytochrome P450 21
(Homo sapiens (Human))
BDBM50092153
(CHEMBL3582478)
Show SMILES CC(C)(O)c1cncc(c1)-c1nc2ccc(F)cc2n1C1CC1
Show InChI InChI=1S/C43H54N6O6/c1-5-28(4)39-42(53)44-22-11-23-55-32-19-16-30(17-20-32)25-36(41(52)49-39)45-26-37(50)35(24-29-12-7-6-8-13-29)47-43(54)38(27(2)3)48-40(51)34-21-18-31-14-9-10-15-33(31)46-34/h6-10,12-21,27-28,35-39,45,50H,5,11,22-26H2,1-4H3,(H,44,53)(H,47,54)(H,48,51)(H,49,52)/t28?,35-,36-,37+,38-,39-/m0/s1
Reactome pathway
n/an/a>1.00E+4n/an/an/an/an/an/a
Merck Research Laboratories
Curated by ChEMBL
Assay Description
Inhibition of human CYP21 expressed in COS7 cells incubated for 1 hr before 17-hydroxypregnenolone substrate addition by HTRF-based assay
ACS Med Chem Lett 6: 573-8 (2015)
Article DOI: 10.1021/acsmedchemlett.5b00054
BindingDB Entry DOI: 10.7270/Q2K64KT8