BDBM50092179 CHEMBL3582467
SMILES: N#Cc1ccc2nc(-c3cccnc3)n(C3CC3)c2c1
InChI Key: InChIKey=CKLZPFFVYAFXEY-UHFFFAOYSA-N
Data: 2 IC50
Activity Spreadsheet -- Enzyme Inhibition Constant Data from BindingDB
Found 2 hits for monomerid = 50092179
Trg + Lig
Ki
nM
ΔG°
kcal/mole
IC50
nM
Kd
nM
EC50/IC50
nM
koff
s-1
kon
M-1s-1
pHTemp
°C
Cytochrome P450 11B2 (CYP11B2)
(Homo sapiens (Human))
BDBM50092179
(CHEMBL3582467)
Show SMILES N#Cc1ccc2nc(-c3cccnc3)n(C3CC3)c2c1
Show InChI InChI=1S/C16H12N4/c17-9-11-3-6-14-15(8-11)20(13-4-5-13)16(19-14)12-2-1-7-18-10-12/h1-3,6-8,10,13H,4-5H2
n/an/a 1.20n/an/an/an/an/an/a
Merck Research Laboratories
Curated by ChEMBL
Assay Description
Inhibition of human CYP11B2 expressed in V79 cells incubated for 1 hr before 11-deoxycorticosterone substrate addition by HTRF-based assay
ACS Med Chem Lett 6: 573-8 (2015)
Article DOI: 10.1021/acsmedchemlett.5b00054
BindingDB Entry DOI: 10.7270/Q2K64KT8
Cytochrome P450 11B1, mitochondrial
(Homo sapiens (Human))
BDBM50092179
(CHEMBL3582467)
Show SMILES N#Cc1ccc2nc(-c3cccnc3)n(C3CC3)c2c1
Show InChI InChI=1S/C16H12N4/c17-9-11-3-6-14-15(8-11)20(13-4-5-13)16(19-14)12-2-1-7-18-10-12/h1-3,6-8,10,13H,4-5H2
n/an/a 374n/an/an/an/an/an/a
Merck Research Laboratories
Curated by ChEMBL
Assay Description
Inhibition of human CYP11B1 expressed in V79 cells incubated for 1 hr before 11-deoxycortisol substrate addition by HTRF-based assay
ACS Med Chem Lett 6: 573-8 (2015)
Article DOI: 10.1021/acsmedchemlett.5b00054
BindingDB Entry DOI: 10.7270/Q2K64KT8