BDBM50092225 7-tert-Butyl-5-(4-phenoxy-phenyl)-7H-pyrrolo[2,3-d]pyrimidin-4-ylamine::CHEMBL302281
SMILES: CC(C)(C)n1cc(-c2ccc(Oc3ccccc3)cc2)c2c(N)ncnc12
InChI Key: InChIKey=MYSJNRWPLKEUQT-UHFFFAOYSA-N
Data: 10 IC50
Activity Spreadsheet -- Enzyme Inhibition Constant Data from BindingDB
Found 10 hits for monomerid = 50092225
Trg + Lig
Ki
nM
ΔG°
kcal/mole
IC50
nM
Kd
nM
EC50/IC50
nM
koff
s-1
kon
M-1s-1
pHTemp
°C
Tyrosine-protein kinase Lck
(Homo sapiens (Human))
BDBM50092225
(7-tert-Butyl-5-(4-phenoxy-phenyl)-7H-pyrrolo[2,3-d...)
Show SMILES CC(C)(C)n1cc(-c2ccc(Oc3ccccc3)cc2)c2c(N)ncnc12
Show InChI InChI=1S/C22H22N4O/c1-22(2,3)26-13-18(19-20(23)24-14-25-21(19)26)15-9-11-17(12-10-15)27-16-7-5-4-6-8-16/h4-14H,1-3H3,(H2,23,24,25)
n/an/a 75n/an/an/an/an/an/a
BASF Bioresearch Corporation
Curated by ChEMBL
Assay Description
Inhibition of p56 Lck tyrosine kinase at 1 mM ATP
Bioorg Med Chem Lett 10: 2167-70 (2001)
BindingDB Entry DOI: 10.7270/Q2J38RTH
Tyrosine-protein kinase Lck
(Homo sapiens (Human))
BDBM50092225
(7-tert-Butyl-5-(4-phenoxy-phenyl)-7H-pyrrolo[2,3-d...)
Show SMILES CC(C)(C)n1cc(-c2ccc(Oc3ccccc3)cc2)c2c(N)ncnc12
Show InChI InChI=1S/C22H22N4O/c1-22(2,3)26-13-18(19-20(23)24-14-25-21(19)26)15-9-11-17(12-10-15)27-16-7-5-4-6-8-16/h4-14H,1-3H3,(H2,23,24,25)
n/an/a 14n/an/an/an/an/an/a
BASF Bioresearch Corporation
Curated by ChEMBL
Assay Description
Inhibition of p56 Lck tyrosine kinase (catalytic domain)
Bioorg Med Chem Lett 10: 2171-4 (2001)
BindingDB Entry DOI: 10.7270/Q2DB813K
Vascular endothelial growth factor receptor 2
(Homo sapiens (Human))
BDBM50092225
(7-tert-Butyl-5-(4-phenoxy-phenyl)-7H-pyrrolo[2,3-d...)
Show SMILES CC(C)(C)n1cc(-c2ccc(Oc3ccccc3)cc2)c2c(N)ncnc12
Show InChI InChI=1S/C22H22N4O/c1-22(2,3)26-13-18(19-20(23)24-14-25-21(19)26)15-9-11-17(12-10-15)27-16-7-5-4-6-8-16/h4-14H,1-3H3,(H2,23,24,25)
NCI pathway
Reactome pathway
n/an/a 2.29E+3n/an/an/an/an/an/a
BASF Bioresearch Corporation
Curated by ChEMBL
Assay Description
Inhibition of Vascular endothelial growth factor receptor 2 at 5 uM ATP
Bioorg Med Chem Lett 10: 2167-70 (2001)
BindingDB Entry DOI: 10.7270/Q2J38RTH
Proto-oncogene tyrosine-protein kinase Src
(Homo sapiens (Human))
BDBM50092225
(7-tert-Butyl-5-(4-phenoxy-phenyl)-7H-pyrrolo[2,3-d...)
Show SMILES CC(C)(C)n1cc(-c2ccc(Oc3ccccc3)cc2)c2c(N)ncnc12
Show InChI InChI=1S/C22H22N4O/c1-22(2,3)26-13-18(19-20(23)24-14-25-21(19)26)15-9-11-17(12-10-15)27-16-7-5-4-6-8-16/h4-14H,1-3H3,(H2,23,24,25)
n/an/a 610n/an/an/an/an/an/a
BASF Bioresearch Corporation
Curated by ChEMBL
Assay Description
Inhibition of src at 5 mM ATP
Bioorg Med Chem Lett 10: 2167-70 (2001)
BindingDB Entry DOI: 10.7270/Q2J38RTH
Tyrosine-protein kinase Lck
(Homo sapiens (Human))
BDBM50092225
(7-tert-Butyl-5-(4-phenoxy-phenyl)-7H-pyrrolo[2,3-d...)
Show SMILES CC(C)(C)n1cc(-c2ccc(Oc3ccccc3)cc2)c2c(N)ncnc12
Show InChI InChI=1S/C22H22N4O/c1-22(2,3)26-13-18(19-20(23)24-14-25-21(19)26)15-9-11-17(12-10-15)27-16-7-5-4-6-8-16/h4-14H,1-3H3,(H2,23,24,25)
n/an/a 2n/an/an/an/an/an/a
BASF Bioresearch Corporation
Curated by ChEMBL
Assay Description
Inhibitory activity against p56 Lck tyrosine kinase at a concentration of 5 uM ATP.
Bioorg Med Chem Lett 10: 2171-4 (2001)
BindingDB Entry DOI: 10.7270/Q2DB813K
Vascular endothelial growth factor receptor 2
(Homo sapiens (Human))
BDBM50092225
(7-tert-Butyl-5-(4-phenoxy-phenyl)-7H-pyrrolo[2,3-d...)
Show SMILES CC(C)(C)n1cc(-c2ccc(Oc3ccccc3)cc2)c2c(N)ncnc12
Show InChI InChI=1S/C22H22N4O/c1-22(2,3)26-13-18(19-20(23)24-14-25-21(19)26)15-9-11-17(12-10-15)27-16-7-5-4-6-8-16/h4-14H,1-3H3,(H2,23,24,25)
NCI pathway
Reactome pathway
n/an/a 2.29E+3n/an/an/an/an/an/a
BASF Bioresearch Corporation
Curated by ChEMBL
Assay Description
Inhibitory activity against vascular endothelial growth factor receptor 2 (VEGFR2) at a concentration of 5 microM ATP.
Bioorg Med Chem Lett 10: 2171-4 (2001)
BindingDB Entry DOI: 10.7270/Q2DB813K
Angiopoietin-1 receptor
(Homo sapiens (Human))
BDBM50092225
(7-tert-Butyl-5-(4-phenoxy-phenyl)-7H-pyrrolo[2,3-d...)
Show SMILES CC(C)(C)n1cc(-c2ccc(Oc3ccccc3)cc2)c2c(N)ncnc12
Show InChI InChI=1S/C22H22N4O/c1-22(2,3)26-13-18(19-20(23)24-14-25-21(19)26)15-9-11-17(12-10-15)27-16-7-5-4-6-8-16/h4-14H,1-3H3,(H2,23,24,25)
n/an/a 2.68E+3n/an/an/an/an/an/a
BASF Bioresearch Corporation
Curated by ChEMBL
Assay Description
Inhibitory activity against tie-2 at a concentration of 5 microM ATP.
Bioorg Med Chem Lett 10: 2171-4 (2001)
BindingDB Entry DOI: 10.7270/Q2DB813K
Tyrosine-protein kinase Lck
(Homo sapiens (Human))
BDBM50092225
(7-tert-Butyl-5-(4-phenoxy-phenyl)-7H-pyrrolo[2,3-d...)
Show SMILES CC(C)(C)n1cc(-c2ccc(Oc3ccccc3)cc2)c2c(N)ncnc12
Show InChI InChI=1S/C22H22N4O/c1-22(2,3)26-13-18(19-20(23)24-14-25-21(19)26)15-9-11-17(12-10-15)27-16-7-5-4-6-8-16/h4-14H,1-3H3,(H2,23,24,25)
n/an/a 2n/an/an/an/an/an/a
BASF Bioresearch Corporation
Curated by ChEMBL
Assay Description
Inhibition of p56 Lck tyrosine kinase catalytic domain at 5 uM ATP
Bioorg Med Chem Lett 10: 2167-70 (2001)
BindingDB Entry DOI: 10.7270/Q2J38RTH
Tyrosine-protein kinase Lck
(Homo sapiens (Human))
BDBM50092225
(7-tert-Butyl-5-(4-phenoxy-phenyl)-7H-pyrrolo[2,3-d...)
Show SMILES CC(C)(C)n1cc(-c2ccc(Oc3ccccc3)cc2)c2c(N)ncnc12
Show InChI InChI=1S/C22H22N4O/c1-22(2,3)26-13-18(19-20(23)24-14-25-21(19)26)15-9-11-17(12-10-15)27-16-7-5-4-6-8-16/h4-14H,1-3H3,(H2,23,24,25)
n/an/a 14n/an/an/an/an/an/a
BASF Bioresearch Corporation
Curated by ChEMBL
Assay Description
Inhibition of p56 Lck tyrosine kinase catalytic domain at 5 uM ATP
Bioorg Med Chem Lett 10: 2167-70 (2001)
BindingDB Entry DOI: 10.7270/Q2J38RTH
Angiopoietin-1 receptor
(Homo sapiens (Human))
BDBM50092225
(7-tert-Butyl-5-(4-phenoxy-phenyl)-7H-pyrrolo[2,3-d...)
Show SMILES CC(C)(C)n1cc(-c2ccc(Oc3ccccc3)cc2)c2c(N)ncnc12
Show InChI InChI=1S/C22H22N4O/c1-22(2,3)26-13-18(19-20(23)24-14-25-21(19)26)15-9-11-17(12-10-15)27-16-7-5-4-6-8-16/h4-14H,1-3H3,(H2,23,24,25)
n/an/a 2.68E+3n/an/an/an/an/an/a
BASF Bioresearch Corporation
Curated by ChEMBL
Assay Description
Inhibition of tie-2 at 5 uM ATP
Bioorg Med Chem Lett 10: 2167-70 (2001)
BindingDB Entry DOI: 10.7270/Q2J38RTH