BDBM50092252 6-Chloro-7-cyclopentyl-5-(4-phenoxy-phenyl)-7H-pyrrolo[2,3-d]pyrimidin-4-ylamine::CHEMBL68430
SMILES: Nc1ncnc2n(C3CCCC3)c(Cl)c(-c3ccc(Oc4ccccc4)cc3)c12
InChI Key: InChIKey=KNDIBTBKZBMNBL-UHFFFAOYSA-N
Data: 4 IC50
Activity Spreadsheet -- Enzyme Inhibition Constant Data from BindingDB
Found 4 hits for monomerid = 50092252
Trg + Lig
Ki
nM
ΔG°
kcal/mole
IC50
nM
Kd
nM
EC50/IC50
nM
koff
s-1
kon
M-1s-1
pHTemp
°C
Tyrosine-protein kinase Lck
(Homo sapiens (Human))
BDBM50092252
(6-Chloro-7-cyclopentyl-5-(4-phenoxy-phenyl)-7H-pyr...)
Show SMILES Nc1ncnc2n(C3CCCC3)c(Cl)c(-c3ccc(Oc4ccccc4)cc3)c12
Show InChI InChI=1S/C23H21ClN4O/c24-21-19(15-10-12-18(13-11-15)29-17-8-2-1-3-9-17)20-22(25)26-14-27-23(20)28(21)16-6-4-5-7-16/h1-3,8-14,16H,4-7H2,(H2,25,26,27)
n/an/a 11n/an/an/an/an/an/a
BASF Bioresearch Corporation
Curated by ChEMBL
Assay Description
Inhibitory activity against p56 Lck tyrosine kinase at a concentration of 5 microM ATP.
Bioorg Med Chem Lett 10: 2171-4 (2001)
BindingDB Entry DOI: 10.7270/Q2DB813K
Tyrosine-protein kinase Lck
(Homo sapiens (Human))
BDBM50092252
(6-Chloro-7-cyclopentyl-5-(4-phenoxy-phenyl)-7H-pyr...)
Show SMILES Nc1ncnc2n(C3CCCC3)c(Cl)c(-c3ccc(Oc4ccccc4)cc3)c12
Show InChI InChI=1S/C23H21ClN4O/c24-21-19(15-10-12-18(13-11-15)29-17-8-2-1-3-9-17)20-22(25)26-14-27-23(20)28(21)16-6-4-5-7-16/h1-3,8-14,16H,4-7H2,(H2,25,26,27)
n/an/a 60n/an/an/an/an/an/a
BASF Bioresearch Corporation
Curated by ChEMBL
Assay Description
Inhibition of p56 Lck tyrosine kinase (catalytic domain)
Bioorg Med Chem Lett 10: 2171-4 (2001)
BindingDB Entry DOI: 10.7270/Q2DB813K
Vascular endothelial growth factor receptor 2
(Homo sapiens (Human))
BDBM50092252
(6-Chloro-7-cyclopentyl-5-(4-phenoxy-phenyl)-7H-pyr...)
Show SMILES Nc1ncnc2n(C3CCCC3)c(Cl)c(-c3ccc(Oc4ccccc4)cc3)c12
Show InChI InChI=1S/C23H21ClN4O/c24-21-19(15-10-12-18(13-11-15)29-17-8-2-1-3-9-17)20-22(25)26-14-27-23(20)28(21)16-6-4-5-7-16/h1-3,8-14,16H,4-7H2,(H2,25,26,27)
NCI pathway
Reactome pathway
n/an/a 1.69E+4n/an/an/an/an/an/a
BASF Bioresearch Corporation
Curated by ChEMBL
Assay Description
Inhibitory activity against vascular endothelial growth factor receptor 2 (VEGFR2) at a concentration of 5 microM ATP.
Bioorg Med Chem Lett 10: 2171-4 (2001)
BindingDB Entry DOI: 10.7270/Q2DB813K
Angiopoietin-1 receptor
(Homo sapiens (Human))
BDBM50092252
(6-Chloro-7-cyclopentyl-5-(4-phenoxy-phenyl)-7H-pyr...)
Show SMILES Nc1ncnc2n(C3CCCC3)c(Cl)c(-c3ccc(Oc4ccccc4)cc3)c12
Show InChI InChI=1S/C23H21ClN4O/c24-21-19(15-10-12-18(13-11-15)29-17-8-2-1-3-9-17)20-22(25)26-14-27-23(20)28(21)16-6-4-5-7-16/h1-3,8-14,16H,4-7H2,(H2,25,26,27)
n/an/a 2.34E+4n/an/an/an/an/an/a
BASF Bioresearch Corporation
Curated by ChEMBL
Assay Description
Inhibitory activity against tie-2 at a concentration of 5 microM ATP.
Bioorg Med Chem Lett 10: 2171-4 (2001)
BindingDB Entry DOI: 10.7270/Q2DB813K