BDBM50092377 4-Benzenesulfonyl-3-benzyl-1-(3H-imidazol-4-ylmethyl)-2,3,4,5-tetrahydro-1H-benzo[e][1,4]diazepine-7-carbonitrile::CHEMBL118669
SMILES: O=S(=O)(N1Cc2cc(ccc2N(Cc2cnc[nH]2)C[C@H]1Cc1ccccc1)C#N)c1ccccc1
InChI Key: InChIKey=RHXLRBJBYOPEAL-RUZDIDTESA-N
Data: 1 IC50
Activity Spreadsheet -- Enzyme Inhibition Constant Data from BindingDB
Found 1 hit for monomerid = 50092377
Trg + Lig
Ki
nM
ΔG°
kcal/mole
IC50
nM
Kd
nM
EC50/IC50
nM
koff
s-1
kon
M-1s-1
pHTemp
°C
Protein Farnesyltransferase (PFT) Chain B
(Homo sapiens (Human))
BDBM50092377
(4-Benzenesulfonyl-3-benzyl-1-(3H-imidazol-4-ylmeth...)
Show SMILES O=S(=O)(N1Cc2cc(ccc2N(Cc2cnc[nH]2)C[C@H]1Cc1ccccc1)C#N)c1ccccc1
Show InChI InChI=1S/C27H25N5O2S/c28-15-22-11-12-27-23(13-22)17-32(35(33,34)26-9-5-2-6-10-26)25(14-21-7-3-1-4-8-21)19-31(27)18-24-16-29-20-30-24/h1-13,16,20,25H,14,17-19H2,(H,29,30)/t25-/m1/s1
n/an/a 1.77n/an/an/an/an/an/a
Bristol-Myers Squibb Pharmaceutical Research Institute
Curated by ChEMBL
Assay Description
Inhibition of purified recombinant human farnesyltransferase (FT)
J Med Chem 43: 3587-95 (2000)
BindingDB Entry DOI: 10.7270/Q2WD3ZSV