null
SMILES: O=C1N(CCC2CCN(CC3COc4ccccc4O3)CC2)Cc2ccccc12
InChI Key: InChIKey=AHGHHUGEWXNAIS-UHFFFAOYSA-N
Activity Spreadsheet -- Enzyme Inhibition Constant Data from BindingDB
Found 1 hit for monomerid = 50092425
Trg + Lig
Ki
nM
ΔG°
kcal/mole
IC50
nM
Kd
nM
EC50/IC50
nM
koff
s-1
kon
M-1s-1
pHTemp
°C
D(2) dopamine receptor
(Rattus norvegicus (rat))
BDBM50092425
(2-{2-[1-(2,3-Dihydro-benzo[1,4]dioxin-2-ylmethyl)-...)
Show SMILES O=C1N(CCC2CCN(CC3COc4ccccc4O3)CC2)Cc2ccccc12
Show InChI InChI=1S/C24H28N2O3/c27-24-21-6-2-1-5-19(21)15-26(24)14-11-18-9-12-25(13-10-18)16-20-17-28-22-7-3-4-8-23(22)29-20/h1-8,18,20H,9-17H2
Reactome pathway
n/an/a 3.80n/an/an/an/an/an/a
Centre de Recherche Pierre Fabre
Curated by ChEMBL
Assay Description
In vitro inhibition of specific binding of [3H]-YM 09151-2 to Dopamine receptor D2 site in rat striatal tissue.
J Med Chem 43: 3653-64 (2000)
BindingDB Entry DOI: 10.7270/Q2MW2GD3