BDBM50092430 1-{2-[1-(2,3-Dihydro-benzo[1,4]dioxin-2-ylmethyl)-piperidin-4-yl]-ethyl}-1-methyl-3-phenyl-urea::CHEMBL121811
SMILES: CN(CCC1CCN(CC2COc3ccccc3O2)CC1)C(=O)Nc1ccccc1
InChI Key: InChIKey=NCFQNALJMWRWNO-UHFFFAOYSA-N
Data: 1 IC50
Activity Spreadsheet -- Enzyme Inhibition Constant Data from BindingDB
Found 1 hit for monomerid = 50092430
Trg + Lig
Ki
nM
ΔG°
kcal/mole
IC50
nM
Kd
nM
EC50/IC50
nM
koff
s-1
kon
M-1s-1
pHTemp
°C
D(2) dopamine receptor
(Rattus norvegicus (rat))
BDBM50092430
(1-{2-[1-(2,3-Dihydro-benzo[1,4]dioxin-2-ylmethyl)-...)
Show SMILES CN(CCC1CCN(CC2COc3ccccc3O2)CC1)C(=O)Nc1ccccc1
Show InChI InChI=1S/C24H31N3O3/c1-26(24(28)25-20-7-3-2-4-8-20)14-11-19-12-15-27(16-13-19)17-21-18-29-22-9-5-6-10-23(22)30-21/h2-10,19,21H,11-18H2,1H3,(H,25,28)
Reactome pathway
n/an/a 36n/an/an/an/an/an/a
Centre de Recherche Pierre Fabre
Curated by ChEMBL
Assay Description
In vitro inhibition of specific binding of [3H]-YM 09151-2 to Dopamine receptor D2 site in rat striatal tissue.
J Med Chem 43: 3653-64 (2000)
BindingDB Entry DOI: 10.7270/Q2MW2GD3