null
SMILES: O=C(NCCC1CCN(CC2COc3ccccc3O2)CC1)NC1CCCCC1
InChI Key: InChIKey=RHMDXGNHLMFANS-UHFFFAOYSA-N
Activity Spreadsheet -- Enzyme Inhibition Constant Data from BindingDB
Found 1 hit for monomerid = 50092451
Trg + Lig
Ki
nM
ΔG°
kcal/mole
IC50
nM
Kd
nM
EC50/IC50
nM
koff
s-1
kon
M-1s-1
pHTemp
°C
D(2) dopamine receptor
(Rattus norvegicus (rat))
BDBM50092451
(1-Cyclohexyl-3-{2-[1-(2,3-dihydro-benzo[1,4]dioxin...)
Show SMILES O=C(NCCC1CCN(CC2COc3ccccc3O2)CC1)NC1CCCCC1
Show InChI InChI=1S/C23H35N3O3/c27-23(25-19-6-2-1-3-7-19)24-13-10-18-11-14-26(15-12-18)16-20-17-28-21-8-4-5-9-22(21)29-20/h4-5,8-9,18-20H,1-3,6-7,10-17H2,(H2,24,25,27)
Reactome pathway
n/an/a 35n/an/an/an/an/an/a
Centre de Recherche Pierre Fabre
Curated by ChEMBL
Assay Description
In vitro inhibition of specific binding of [3H]-YM 09151-2 to Dopamine receptor D2 site in rat striatal tissue.
J Med Chem 43: 3653-64 (2000)
BindingDB Entry DOI: 10.7270/Q2MW2GD3