BDBM50092541 4-Amino-5-chloro-2-methoxy-benzoic acid 2-piperazin-1-yl-ethyl ester::CHEMBL125005
SMILES: COc1cc(N)c(Cl)cc1C(=O)OCCN1CCNCC1
InChI Key: InChIKey=STXPSWHCNHJFSS-UHFFFAOYSA-N
Data: 1 KI
Activity Spreadsheet -- Enzyme Inhibition Constant Data from BindingDB
Found 1 hit for monomerid = 50092541
Trg + Lig
Ki
nM
ΔG°
kcal/mole
IC50
nM
Kd
nM
EC50/IC50
nM
koff
s-1
kon
M-1s-1
pHTemp
°C
5-hydroxytryptamine receptor 4 (5-HT4)
(Homo sapiens (Human))
BDBM50092541
(4-Amino-5-chloro-2-methoxy-benzoic acid 2-piperazi...)
Show SMILES COc1cc(N)c(Cl)cc1C(=O)OCCN1CCNCC1
Show InChI InChI=1S/C14H20ClN3O3/c1-20-13-9-12(16)11(15)8-10(13)14(19)21-7-6-18-4-2-17-3-5-18/h8-9,17H,2-7,16H2,1H3
>1.00E+3n/an/an/an/an/an/an/an/a
INSERM
Curated by ChEMBL
Assay Description
Binding affinity was determined against cloned 5-hydroxytryptamine 4E receptor isoform expressed in C6 glial cells incubated with 0.2 nM [3H]-GR-113,...
J Med Chem 43: 3761-9 (2000)
BindingDB Entry DOI: 10.7270/Q2CC0ZXH