BDBM50092560 4-[2-(4-Amino-5-chloro-2-methoxy-benzoyloxy)-ethyl]-piperazine-1-carboxylic acid ethyl ester::CHEMBL122818
SMILES: CCOC(=O)N1CCN(CCOC(=O)c2cc(Cl)c(N)cc2OC)CC1
InChI Key: InChIKey=MKJUSWFBSFKEPH-UHFFFAOYSA-N
Data: 1 KI
Activity Spreadsheet -- Enzyme Inhibition Constant Data from BindingDB
Found 1 hit for monomerid = 50092560
Trg + Lig
Ki
nM
ΔG°
kcal/mole
IC50
nM
Kd
nM
EC50/IC50
nM
koff
s-1
kon
M-1s-1
pHTemp
°C
5-hydroxytryptamine receptor 4 (5-HT4)
(Homo sapiens (Human))
BDBM50092560
(4-[2-(4-Amino-5-chloro-2-methoxy-benzoyloxy)-ethyl...)
Show SMILES CCOC(=O)N1CCN(CCOC(=O)c2cc(Cl)c(N)cc2OC)CC1
Show InChI InChI=1S/C17H24ClN3O5/c1-3-25-17(23)21-6-4-20(5-7-21)8-9-26-16(22)12-10-13(18)14(19)11-15(12)24-2/h10-11H,3-9,19H2,1-2H3
23n/an/an/an/an/an/an/an/a
INSERM
Curated by ChEMBL
Assay Description
Binding affinity was determined against cloned 5-hydroxytryptamine 4E receptor isoform expressed in C6 glial cells incubated with 0.2 nM [3H]-GR-113,...
J Med Chem 43: 3761-9 (2000)
BindingDB Entry DOI: 10.7270/Q2CC0ZXH