null
SMILES: Ic1cc(-c2cccc(c2)N=[N+]=[N-])c2ncccc2c1
InChI Key: InChIKey=PBIQIEZSLAPKDM-UHFFFAOYSA-N
Activity Spreadsheet -- Enzyme Inhibition Constant Data from BindingDB
Found 1 hit for monomerid = 50092633
Trg + Lig
Ki
nM
ΔG°
kcal/mole
IC50
nM
Kd
nM
EC50/IC50
nM
koff
s-1
kon
M-1s-1
pHTemp
°C
cAMP-specific 3',5'-cyclic phosphodiesterase 4A
(Homo sapiens (Human))
BDBM50092633
(8-(3-Azido-phenyl)-6-iodo-quinoline | CHEMBL127994)
Show SMILES Ic1cc(-c2cccc(c2)N=[N+]=[N-])c2ncccc2c1
Show InChI InChI=1S/C15H9IN4/c16-12-7-11-4-2-6-18-15(11)14(9-12)10-3-1-5-13(8-10)19-20-17/h1-9H
n/an/a 2.70n/an/an/an/an/an/a
Merck Frosst Centre for Therapeutic Research
Curated by ChEMBL
Assay Description
Inhibition of recombinant human PDE4A expressed in Sf9 cells
J Med Chem 43: 3820-3 (2000)
BindingDB Entry DOI: 10.7270/Q23T9GG9