null
SMILES: CCN(CC)C(=O)c1ccc(cc1)C(N1CCNCC1)c1cccc(F)c1
InChI Key: InChIKey=XKUBARQOTAUWNS-UHFFFAOYSA-N
Activity Spreadsheet -- Enzyme Inhibition Constant Data from BindingDB
Found 4 hits for monomerid = 50092665
Trg + Lig
Ki
nM
ΔG°
kcal/mole
IC50
nM
Kd
nM
EC50/IC50
nM
koff
s-1
kon
M-1s-1
pHTemp
°C
Delta-type opioid receptor
(Homo sapiens (Human))
BDBM50092665
(CHEMBL340834 | N,N-Diethyl-4-[(3-fluoro-phenyl)-pi...)
Show SMILES CCN(CC)C(=O)c1ccc(cc1)C(N1CCNCC1)c1cccc(F)c1
Show InChI InChI=1S/C22H28FN3O/c1-3-25(4-2)22(27)18-10-8-17(9-11-18)21(26-14-12-24-13-15-26)19-6-5-7-20(23)16-19/h5-11,16,21,24H,3-4,12-15H2,1-2H3
Reactome pathway
n/an/an/an/a 53n/an/an/an/a
AstraZeneca R&D Montreal
Curated by ChEMBL
Assay Description
Agonist potency was measured using GTP gamma-[35S] binding assay
J Med Chem 43: 3878-94 (2000)
BindingDB Entry DOI: 10.7270/Q2QN661W
Kappa-type opioid receptor
(Homo sapiens (Human))
BDBM50092665
(CHEMBL340834 | N,N-Diethyl-4-[(3-fluoro-phenyl)-pi...)
Show SMILES CCN(CC)C(=O)c1ccc(cc1)C(N1CCNCC1)c1cccc(F)c1
Show InChI InChI=1S/C22H28FN3O/c1-3-25(4-2)22(27)18-10-8-17(9-11-18)21(26-14-12-24-13-15-26)19-6-5-7-20(23)16-19/h5-11,16,21,24H,3-4,12-15H2,1-2H3
Reactome pathway
n/an/a>1.00E+4n/an/an/an/an/an/a
AstraZeneca R&D Montreal
Curated by ChEMBL
Assay Description
Binding affinity against cloned human Opioid receptor kappa 1 using [125I]-D-Pro10-dynorphin A[1-11] as radioligand
J Med Chem 43: 3878-94 (2000)
BindingDB Entry DOI: 10.7270/Q2QN661W
Mu-type opioid receptor
(Homo sapiens (Human))
BDBM50092665
(CHEMBL340834 | N,N-Diethyl-4-[(3-fluoro-phenyl)-pi...)
Show SMILES CCN(CC)C(=O)c1ccc(cc1)C(N1CCNCC1)c1cccc(F)c1
Show InChI InChI=1S/C22H28FN3O/c1-3-25(4-2)22(27)18-10-8-17(9-11-18)21(26-14-12-24-13-15-26)19-6-5-7-20(23)16-19/h5-11,16,21,24H,3-4,12-15H2,1-2H3
NCI pathway
Reactome pathway
n/an/a 5.65E+3n/an/an/an/an/an/a
AstraZeneca R&D Montreal
Curated by ChEMBL
Assay Description
Binding affinity against cloned human Opioid receptor mu 1 using [125I]FK33824 as radioligand
J Med Chem 43: 3878-94 (2000)
BindingDB Entry DOI: 10.7270/Q2QN661W
Delta-type opioid receptor
(Homo sapiens (Human))
BDBM50092665
(CHEMBL340834 | N,N-Diethyl-4-[(3-fluoro-phenyl)-pi...)
Show SMILES CCN(CC)C(=O)c1ccc(cc1)C(N1CCNCC1)c1cccc(F)c1
Show InChI InChI=1S/C22H28FN3O/c1-3-25(4-2)22(27)18-10-8-17(9-11-18)21(26-14-12-24-13-15-26)19-6-5-7-20(23)16-19/h5-11,16,21,24H,3-4,12-15H2,1-2H3
Reactome pathway
n/an/a 4.5n/an/an/an/an/an/a
AstraZeneca R&D Montreal
Curated by ChEMBL
Assay Description
Binding affinity against human opioid receptor delta 1 using [125I]-[D-Ala2]-deltorphin II as radioligand
J Med Chem 43: 3878-94 (2000)
BindingDB Entry DOI: 10.7270/Q2QN661W