BDBM50092770 CHEMBL3586398
SMILES: CO[C@H]1CC[C@H](CN2CC(=O)Nc3ncc(nc23)-c2ccc(nc2)C(C)(C)O)CC1
InChI Key: InChIKey=YDXFZRXCBRFBQS-IAGOWNOFSA-N
Data: 3 IC50
Activity Spreadsheet -- Enzyme Inhibition Constant Data from BindingDB
Found 3 hits for monomerid = 50092770
Trg + Lig
Ki
nM
ΔG°
kcal/mole
IC50
nM
Kd
nM
EC50/IC50
nM
koff
s-1
kon
M-1s-1
pHTemp
°C
Phosphatidylinositol 4,5-bisphosphate 3-kinase catalytic subunit alpha isoform
(Homo sapiens (Human))
BDBM50092770
(CHEMBL3586398)
Show SMILES CO[C@H]1CC[C@H](CN2CC(=O)Nc3ncc(nc23)-c2ccc(nc2)C(C)(C)O)CC1 |r,wU:2.1,wD:5.5,(6.68,7.38,;6.68,6.15,;5.34,5.38,;5.34,3.84,;4,3.07,;2.67,3.85,;1.33,3.08,;1.33,1.54,;2.66,.77,;2.66,-.77,;3.73,-1.38,;1.33,-1.54,;,-.77,;-1.33,-1.54,;-2.68,-.77,;-2.68,.77,;-1.33,1.54,;,.77,;-4.01,1.54,;-4.01,3.08,;-5.35,3.85,;-6.68,3.08,;-6.68,1.54,;-5.35,.77,;-8.02,3.85,;-9.08,3.23,;-9.08,4.47,;-8.02,5.08,;2.68,5.39,;4.01,6.15,)|
Show InChI InChI=1S/C18H22N4/c1-2-5-15(6-3-1)17-13-16(17)14-21-9-11-22(12-10-21)18-19-7-4-8-20-18/h1-8,16-17H,9-14H2/t16-,17-/m1/s1
NCI pathway
Reactome pathway
n/an/a 2.02E+4n/an/an/an/an/an/a
Celgene Corporation
Curated by ChEMBL
Assay Description
Inhibition of PI3K-alpha (unknown origin) by mobility shift assay
J Med Chem 58: 5323-33 (2015)
Article DOI: 10.1021/acs.jmedchem.5b00626
BindingDB Entry DOI: 10.7270/Q208672F
Serine/threonine-protein kinase mTOR
(Homo sapiens (Human))
BDBM50092770
(CHEMBL3586398)
Show SMILES CO[C@H]1CC[C@H](CN2CC(=O)Nc3ncc(nc23)-c2ccc(nc2)C(C)(C)O)CC1 |r,wU:2.1,wD:5.5,(6.68,7.38,;6.68,6.15,;5.34,5.38,;5.34,3.84,;4,3.07,;2.67,3.85,;1.33,3.08,;1.33,1.54,;2.66,.77,;2.66,-.77,;3.73,-1.38,;1.33,-1.54,;,-.77,;-1.33,-1.54,;-2.68,-.77,;-2.68,.77,;-1.33,1.54,;,.77,;-4.01,1.54,;-4.01,3.08,;-5.35,3.85,;-6.68,3.08,;-6.68,1.54,;-5.35,.77,;-8.02,3.85,;-9.08,3.23,;-9.08,4.47,;-8.02,5.08,;2.68,5.39,;4.01,6.15,)|
Show InChI InChI=1S/C18H22N4/c1-2-5-15(6-3-1)17-13-16(17)14-21-9-11-22(12-10-21)18-19-7-4-8-20-18/h1-8,16-17H,9-14H2/t16-,17-/m1/s1
NCI pathway
Reactome pathway
n/an/a 170n/an/an/an/an/an/a
Celgene Corporation
Curated by ChEMBL
Assay Description
Inhibition of mTOR (unknown origin) by HTR-FRET substrate phosphorylation assay
J Med Chem 58: 5323-33 (2015)
Article DOI: 10.1021/acs.jmedchem.5b00626
BindingDB Entry DOI: 10.7270/Q208672F
Mammalian target of Rapamycin (mTORC1)
(Homo sapiens (Human))
BDBM50092770
(CHEMBL3586398)
Show SMILES CO[C@H]1CC[C@H](CN2CC(=O)Nc3ncc(nc23)-c2ccc(nc2)C(C)(C)O)CC1 |r,wU:2.1,wD:5.5,(6.68,7.38,;6.68,6.15,;5.34,5.38,;5.34,3.84,;4,3.07,;2.67,3.85,;1.33,3.08,;1.33,1.54,;2.66,.77,;2.66,-.77,;3.73,-1.38,;1.33,-1.54,;,-.77,;-1.33,-1.54,;-2.68,-.77,;-2.68,.77,;-1.33,1.54,;,.77,;-4.01,1.54,;-4.01,3.08,;-5.35,3.85,;-6.68,3.08,;-6.68,1.54,;-5.35,.77,;-8.02,3.85,;-9.08,3.23,;-9.08,4.47,;-8.02,5.08,;2.68,5.39,;4.01,6.15,)|
Show InChI InChI=1S/C18H22N4/c1-2-5-15(6-3-1)17-13-16(17)14-21-9-11-22(12-10-21)18-19-7-4-8-20-18/h1-8,16-17H,9-14H2/t16-,17-/m1/s1
n/an/a 230n/an/an/an/an/an/a
Celgene Corporation
Curated by ChEMBL
Assay Description
Inhibition of mTORC1 in human PC3 cells assessed as inhibition of S6 phosphorylation after 1 hr
J Med Chem 58: 5323-33 (2015)
Article DOI: 10.1021/acs.jmedchem.5b00626
BindingDB Entry DOI: 10.7270/Q208672F