BDBM50092883 2-Chloro-4-phenyl-pyrimidine-5-carboxylic acid (3,5-bis-trifluoromethyl-phenyl)-amide::CHEMBL423150
SMILES: FC(F)(F)c1cc(NC(=O)c2cnc(Cl)nc2-c2ccccc2)cc(c1)C(F)(F)F
InChI Key: InChIKey=BFANKIPRJRXYSS-UHFFFAOYSA-N
Data: 2 IC50
Activity Spreadsheet -- Enzyme Inhibition Constant Data from BindingDB
Found 2 hits for monomerid = 50092883
Trg + Lig
Ki
nM
ΔG°
kcal/mole
IC50
nM
Kd
nM
EC50/IC50
nM
koff
s-1
kon
M-1s-1
pHTemp
°C
Transcription factor AP-1
(Homo sapiens (Human))
BDBM50092883
(2-Chloro-4-phenyl-pyrimidine-5-carboxylic acid (3,...)
Show SMILES FC(F)(F)c1cc(NC(=O)c2cnc(Cl)nc2-c2ccccc2)cc(c1)C(F)(F)F
Show InChI InChI=1S/C19H10ClF6N3O/c20-17-27-9-14(15(29-17)10-4-2-1-3-5-10)16(30)28-13-7-11(18(21,22)23)6-12(8-13)19(24,25)26/h1-9H,(H,28,30)
n/an/a 400n/an/an/an/an/an/a
University of Texas Medical Branch
Curated by ChEMBL
Assay Description
Inhibition of AP-1-mediated transcriptional activation in human Jurkat cells by luciferase reporter gene assay
J Med Chem 57: 6930-48 (2014)
Article DOI: 10.1021/jm5004733
BindingDB Entry DOI: 10.7270/Q2222WDT
Transcription factor AP-1
(Homo sapiens (Human))
BDBM50092883
(2-Chloro-4-phenyl-pyrimidine-5-carboxylic acid (3,...)
Show SMILES FC(F)(F)c1cc(NC(=O)c2cnc(Cl)nc2-c2ccccc2)cc(c1)C(F)(F)F
Show InChI InChI=1S/C19H10ClF6N3O/c20-17-27-9-14(15(29-17)10-4-2-1-3-5-10)16(30)28-13-7-11(18(21,22)23)6-12(8-13)19(24,25)26/h1-9H,(H,28,30)
n/an/a 400n/an/an/an/an/an/a
Signal Pharmaceuticals, Inc.
Curated by ChEMBL
Assay Description
Concentration required to inhibit activator protein-1(AP-1) mediated transcriptional activation in human Jurkat T-cells
J Med Chem 43: 3995-4004 (2000)
BindingDB Entry DOI: 10.7270/Q26M363N