BDBM50092887 4-Methyl-2-trifluoromethyl-pyrimidine-5-carboxylic acid (3,5-bis-trifluoromethyl-phenyl)-amide::CHEMBL131007
SMILES: Cc1nc(ncc1C(=O)Nc1cc(cc(c1)C(F)(F)F)C(F)(F)F)C(F)(F)F
InChI Key: InChIKey=SGKUTFVUTBIBKR-UHFFFAOYSA-N
Data: 1 IC50
Activity Spreadsheet -- Enzyme Inhibition Constant Data from BindingDB
Found 1 hit for monomerid = 50092887
Trg + Lig
Ki
nM
ΔG°
kcal/mole
IC50
nM
Kd
nM
EC50/IC50
nM
koff
s-1
kon
M-1s-1
pHTemp
°C
Transcription factor Jun
(Homo sapiens (Human))
BDBM50092887
(4-Methyl-2-trifluoromethyl-pyrimidine-5-carboxylic...)
Show SMILES Cc1nc(ncc1C(=O)Nc1cc(cc(c1)C(F)(F)F)C(F)(F)F)C(F)(F)F
Show InChI InChI=1S/C15H8F9N3O/c1-6-10(5-25-12(26-6)15(22,23)24)11(28)27-9-3-7(13(16,17)18)2-8(4-9)14(19,20)21/h2-5H,1H3,(H,27,28)
n/an/a>1.00E+4n/an/an/an/an/an/a
Signal Pharmaceuticals, Inc.
Curated by ChEMBL
Assay Description
Concentration required to inhibit activator protein-1(AP-1) mediated transcriptional activation in human Jurkat T-cells
J Med Chem 43: 3995-4004 (2000)
BindingDB Entry DOI: 10.7270/Q26M363N