BDBM50093057 (R)-5-Guanidino-2-phenylmethanesulfonylamino-pentanoic acid [((S)-3-carbamimidoyl-2-hydroxy-cyclohexylcarbamoyl)-methyl]-methyl-amide::CHEMBL431985
SMILES: CN(CC(=O)N[C@H]1CCCC(C1O)C(N)=N)C(=O)[C@@H](CCCNC(N)=N)NS(=O)(=O)Cc1ccccc1
InChI Key: InChIKey=ABJUGLXDGYDGLY-AGYKMIKPSA-N
Data: 5 IC50
Activity Spreadsheet -- Enzyme Inhibition Constant Data from BindingDB
Found 5 hits for monomerid = 50093057
Trg + Lig
Ki
nM
ΔG°
kcal/mole
IC50
nM
Kd
nM
EC50/IC50
nM
koff
s-1
kon
M-1s-1
pHTemp
°C
Coagulation factor X
(Homo sapiens (Human))
BDBM50093057
((R)-5-Guanidino-2-phenylmethanesulfonylamino-penta...)
Show SMILES CN(CC(=O)N[C@H]1CCCC(C1O)C(N)=N)C(=O)[C@@H](CCCNC(N)=N)NS(=O)(=O)Cc1ccccc1
Show InChI InChI=1S/C23H38N8O5S/c1-31(13-19(32)29-17-10-5-9-16(20(17)33)21(24)25)22(34)18(11-6-12-28-23(26)27)30-37(35,36)14-15-7-3-2-4-8-15/h2-4,7-8,16-18,20,30,33H,5-6,9-14H2,1H3,(H3,24,25)(H,29,32)(H4,26,27,28)/t16?,17-,18+,20?/m0/s1
Reactome pathway
n/an/a 3.40n/an/an/an/an/an/a
Corvas International, Inc.
Curated by ChEMBL
Assay Description
Compound was evaluated in vitro for its inhibitory activity against prothrombinase (PTase) complex
Bioorg Med Chem Lett 10: 2305-9 (2001)
BindingDB Entry DOI: 10.7270/Q25Q4VBR
Prothrombin
(Homo sapiens (Human))
BDBM50093057
((R)-5-Guanidino-2-phenylmethanesulfonylamino-penta...)
Show SMILES CN(CC(=O)N[C@H]1CCCC(C1O)C(N)=N)C(=O)[C@@H](CCCNC(N)=N)NS(=O)(=O)Cc1ccccc1
Show InChI InChI=1S/C23H38N8O5S/c1-31(13-19(32)29-17-10-5-9-16(20(17)33)21(24)25)22(34)18(11-6-12-28-23(26)27)30-37(35,36)14-15-7-3-2-4-8-15/h2-4,7-8,16-18,20,30,33H,5-6,9-14H2,1H3,(H3,24,25)(H,29,32)(H4,26,27,28)/t16?,17-,18+,20?/m0/s1
n/an/a>2.50E+3n/an/an/an/an/an/a
Corvas International, Inc.
Curated by ChEMBL
Assay Description
Compound was evaluated in vitro for its inhibitory activity against Thrombin (FIIa)
Bioorg Med Chem Lett 10: 2305-9 (2001)
BindingDB Entry DOI: 10.7270/Q25Q4VBR
Coagulation factor X
(Homo sapiens (Human))
BDBM50093057
((R)-5-Guanidino-2-phenylmethanesulfonylamino-penta...)
Show SMILES CN(CC(=O)N[C@H]1CCCC(C1O)C(N)=N)C(=O)[C@@H](CCCNC(N)=N)NS(=O)(=O)Cc1ccccc1
Show InChI InChI=1S/C23H38N8O5S/c1-31(13-19(32)29-17-10-5-9-16(20(17)33)21(24)25)22(34)18(11-6-12-28-23(26)27)30-37(35,36)14-15-7-3-2-4-8-15/h2-4,7-8,16-18,20,30,33H,5-6,9-14H2,1H3,(H3,24,25)(H,29,32)(H4,26,27,28)/t16?,17-,18+,20?/m0/s1
Reactome pathway
n/an/a 0.860n/an/an/an/an/an/a
Corvas International, Inc.
Curated by ChEMBL
Assay Description
Inhibitory activity against Coagulation factor X
Bioorg Med Chem Lett 10: 2305-9 (2001)
BindingDB Entry DOI: 10.7270/Q25Q4VBR
Plasminogen
(Homo sapiens (Human))
BDBM50093057
((R)-5-Guanidino-2-phenylmethanesulfonylamino-penta...)
Show SMILES CN(CC(=O)N[C@H]1CCCC(C1O)C(N)=N)C(=O)[C@@H](CCCNC(N)=N)NS(=O)(=O)Cc1ccccc1
Show InChI InChI=1S/C23H38N8O5S/c1-31(13-19(32)29-17-10-5-9-16(20(17)33)21(24)25)22(34)18(11-6-12-28-23(26)27)30-37(35,36)14-15-7-3-2-4-8-15/h2-4,7-8,16-18,20,30,33H,5-6,9-14H2,1H3,(H3,24,25)(H,29,32)(H4,26,27,28)/t16?,17-,18+,20?/m0/s1
NCI pathway
Reactome pathway
n/an/a 1.20E+3n/an/an/an/an/an/a
Corvas International, Inc.
Curated by ChEMBL
Assay Description
Compound was evaluated in vitro for its inhibitory activity against plasmin
Bioorg Med Chem Lett 10: 2305-9 (2001)
BindingDB Entry DOI: 10.7270/Q25Q4VBR
Trypsin-1
(Homo sapiens (Human))
BDBM50093057
((R)-5-Guanidino-2-phenylmethanesulfonylamino-penta...)
Show SMILES CN(CC(=O)N[C@H]1CCCC(C1O)C(N)=N)C(=O)[C@@H](CCCNC(N)=N)NS(=O)(=O)Cc1ccccc1
Show InChI InChI=1S/C23H38N8O5S/c1-31(13-19(32)29-17-10-5-9-16(20(17)33)21(24)25)22(34)18(11-6-12-28-23(26)27)30-37(35,36)14-15-7-3-2-4-8-15/h2-4,7-8,16-18,20,30,33H,5-6,9-14H2,1H3,(H3,24,25)(H,29,32)(H4,26,27,28)/t16?,17-,18+,20?/m0/s1
Reactome pathway
n/an/a 75n/an/an/an/an/an/a
Corvas International, Inc.
Curated by ChEMBL
Assay Description
Compound was evaluated in vitro for its inhibitory activity against Human trypsin
Bioorg Med Chem Lett 10: 2305-9 (2001)
BindingDB Entry DOI: 10.7270/Q25Q4VBR