null
SMILES: CO[C@H]1CC[C@@H](CC1)N1C(=O)CNc2ncc(nc12)-c1ccc(nc1C)-c1nc[nH]n1
InChI Key:
Activity Spreadsheet -- Enzyme Inhibition Constant Data from BindingDB
Found 2 hits for monomerid = 50093074
Trg + Lig
Ki
nM
ΔG°
kcal/mole
IC50
nM
Kd
nM
EC50/IC50
nM
koff
s-1
kon
M-1s-1
pHTemp
°C
FKBP12A/mTOR
(Homo sapiens (Human))
BDBM50093074
(CHEMBL3586565)
Show SMILES CO[C@H]1CC[C@@H](CC1)N1C(=O)CNc2ncc(nc12)-c1ccc(nc1C)-c1nc[nH]n1 |r,wU:5.8,wD:2.1,(2.39,8.32,;1.33,7.7,;1.33,6.16,;-.01,5.39,;-0,3.85,;1.33,3.08,;2.66,3.85,;2.66,5.39,;1.33,1.54,;2.66,.77,;3.73,1.38,;2.66,-.77,;1.33,-1.54,;,-.77,;-1.33,-1.54,;-2.68,-.77,;-2.68,.77,;-1.33,1.54,;,.77,;-4.01,1.54,;-5.35,.77,;-6.68,1.54,;-6.68,3.08,;-5.35,3.85,;-4.01,3.08,;-2.95,3.7,;-8.02,3.85,;-8.16,5.37,;-9.66,5.69,;-10.43,4.36,;-9.4,3.21,)|
n/an/a 20n/an/an/an/an/an/a
Celgene Corporation
Curated by ChEMBL
Assay Description
Inhibition of mTORC1 in human PC3 cells assessed as inhibition of S6 phosphorylation after 1 hr
J Med Chem 58: 5599-608 (2015)
Article DOI: 10.1021/acs.jmedchem.5b00627
BindingDB Entry DOI: 10.7270/Q2BG2QRV
Serine/threonine-protein kinase mTOR
(Homo sapiens (Human))
BDBM50093074
(CHEMBL3586565)
Show SMILES CO[C@H]1CC[C@@H](CC1)N1C(=O)CNc2ncc(nc12)-c1ccc(nc1C)-c1nc[nH]n1 |r,wU:5.8,wD:2.1,(2.39,8.32,;1.33,7.7,;1.33,6.16,;-.01,5.39,;-0,3.85,;1.33,3.08,;2.66,3.85,;2.66,5.39,;1.33,1.54,;2.66,.77,;3.73,1.38,;2.66,-.77,;1.33,-1.54,;,-.77,;-1.33,-1.54,;-2.68,-.77,;-2.68,.77,;-1.33,1.54,;,.77,;-4.01,1.54,;-5.35,.77,;-6.68,1.54,;-6.68,3.08,;-5.35,3.85,;-4.01,3.08,;-2.95,3.7,;-8.02,3.85,;-8.16,5.37,;-9.66,5.69,;-10.43,4.36,;-9.4,3.21,)|
NCI pathway
Reactome pathway
n/an/a 15n/an/an/an/an/an/a
Celgene Corporation
Curated by ChEMBL
Assay Description
Inhibition of mTOR (unknown origin) by HTR-FRET substrate phosphorylation assay
J Med Chem 58: 5599-608 (2015)
Article DOI: 10.1021/acs.jmedchem.5b00627
BindingDB Entry DOI: 10.7270/Q2BG2QRV