BDBM50093227 CHEMBL3586608
SMILES: Cl.CN(Cc1ccccc1)Cc1ccc(COc2ccc3c(CO)cc(=O)oc3c2)cc1
InChI Key: InChIKey=USTALMYDYGSTPY-UHFFFAOYSA-N
Data: 1 KI  7 IC50
Activity Spreadsheet -- Enzyme Inhibition Constant Data from BindingDB
Found 8 hits for monomerid = 50093227
Trg + Lig
Ki
nM
ΔG°
kcal/mole
IC50
nM
Kd
nM
EC50/IC50
nM
koff
s-1
kon
M-1s-1
pHTemp
°C
Acetylcholinesterase
(Electrophorus electricus (Electric eel))
BDBM50093227
(CHEMBL3586608)
Show SMILES Cl.CN(Cc1ccccc1)Cc1ccc(COc2ccc3c(CO)cc(=O)oc3c2)cc1
Show InChI InChI=1S/C17H13NO/c1-11-15-4-2-3-13-7-10-16(18(13)15)17(11)12-5-8-14(19)9-6-12/h2-10,19H,1H3
100n/an/an/an/an/an/an/an/a
Universit£ degli Studi di Bari"Aldo Moro"
Curated by ChEMBL
Assay Description
Mixed type inhibition of electric eel AChE by Lineweaver-Burk plot
J Med Chem 58: 5561-78 (2015)
Article DOI: 10.1021/acs.jmedchem.5b00599
BindingDB Entry DOI: 10.7270/Q26T0PCZ
Butyrylcholinesterase (BuChE)
(Equus caballus (Horse))
BDBM50093227
(CHEMBL3586608)
Show SMILES Cl.CN(Cc1ccccc1)Cc1ccc(COc2ccc3c(CO)cc(=O)oc3c2)cc1
Show InChI InChI=1S/C17H13NO/c1-11-15-4-2-3-13-7-10-16(18(13)15)17(11)12-5-8-14(19)9-6-12/h2-10,19H,1H3
n/an/a 1.10E+3n/an/an/an/an/an/a
Universit£ degli Studi di Bari"Aldo Moro"
Curated by ChEMBL
Assay Description
Inhibition of equine serum BuChE by spectrophotometric Ellman's method
J Med Chem 58: 5561-78 (2015)
Article DOI: 10.1021/acs.jmedchem.5b00599
BindingDB Entry DOI: 10.7270/Q26T0PCZ
Acetylcholinesterase
(Homo sapiens (Human))
BDBM50093227
(CHEMBL3586608)
Show SMILES Cl.CN(Cc1ccccc1)Cc1ccc(COc2ccc3c(CO)cc(=O)oc3c2)cc1
Show InChI InChI=1S/C17H13NO/c1-11-15-4-2-3-13-7-10-16(18(13)15)17(11)12-5-8-14(19)9-6-12/h2-10,19H,1H3
NCI pathway
Reactome pathway
n/an/a 120n/an/an/an/an/an/a
Universit£ degli Studi di Bari"Aldo Moro"
Curated by ChEMBL
Assay Description
Inhibition of human recombinant AChE by spectrophotometric Ellman's method
J Med Chem 58: 5561-78 (2015)
Article DOI: 10.1021/acs.jmedchem.5b00599
BindingDB Entry DOI: 10.7270/Q26T0PCZ
Acetylcholinesterase
(Electrophorus electricus (Electric eel))
BDBM50093227
(CHEMBL3586608)
Show SMILES Cl.CN(Cc1ccccc1)Cc1ccc(COc2ccc3c(CO)cc(=O)oc3c2)cc1
Show InChI InChI=1S/C17H13NO/c1-11-15-4-2-3-13-7-10-16(18(13)15)17(11)12-5-8-14(19)9-6-12/h2-10,19H,1H3
n/an/a 420n/an/an/an/an/an/a
Universit£ degli Studi di Bari"Aldo Moro"
Curated by ChEMBL
Assay Description
Inhibition of electric eel AChE by spectrophotometric Ellman's method
J Med Chem 58: 5561-78 (2015)
Article DOI: 10.1021/acs.jmedchem.5b00599
BindingDB Entry DOI: 10.7270/Q26T0PCZ
Amine oxidase (flavin-containing) A
(Homo sapiens (Human))
BDBM50093227
(CHEMBL3586608)
Show SMILES Cl.CN(Cc1ccccc1)Cc1ccc(COc2ccc3c(CO)cc(=O)oc3c2)cc1
Show InChI InChI=1S/C17H13NO/c1-11-15-4-2-3-13-7-10-16(18(13)15)17(11)12-5-8-14(19)9-6-12/h2-10,19H,1H3
n/an/a 1.58E+4n/an/an/an/an/an/a
Universit£ degli Studi di Bari"Aldo Moro"
Curated by ChEMBL
Assay Description
Inhibition of human recombinant MAO-A using kynuramine substrate by spectrophotometric assay
J Med Chem 58: 5561-78 (2015)
Article DOI: 10.1021/acs.jmedchem.5b00599
BindingDB Entry DOI: 10.7270/Q26T0PCZ
Amine oxidase [flavin-containing] B
(Homo sapiens (Human))
BDBM50093227
(CHEMBL3586608)
Show SMILES Cl.CN(Cc1ccccc1)Cc1ccc(COc2ccc3c(CO)cc(=O)oc3c2)cc1
Show InChI InChI=1S/C17H13NO/c1-11-15-4-2-3-13-7-10-16(18(13)15)17(11)12-5-8-14(19)9-6-12/h2-10,19H,1H3
n/an/a 10n/an/an/an/an/an/a
Universit£ degli Studi di Bari"Aldo Moro"
Curated by ChEMBL
Assay Description
Inhibition of human recombinant MAO-B using kynuramine substrate by spectrophotometric assay
J Med Chem 58: 5561-78 (2015)
Article DOI: 10.1021/acs.jmedchem.5b00599
BindingDB Entry DOI: 10.7270/Q26T0PCZ
Cholinesterases
(Homo sapiens (Human))
BDBM50093227
(CHEMBL3586608)
Show SMILES Cl.CN(Cc1ccccc1)Cc1ccc(COc2ccc3c(CO)cc(=O)oc3c2)cc1
Show InChI InChI=1S/C17H13NO/c1-11-15-4-2-3-13-7-10-16(18(13)15)17(11)12-5-8-14(19)9-6-12/h2-10,19H,1H3
Reactome pathway
n/an/a 9.30E+3n/an/an/an/an/an/a
Universit£ degli Studi di Bari"Aldo Moro"
Curated by ChEMBL
Assay Description
Inhibition of human serum BuChE by spectrophotometric Ellman's method
J Med Chem 58: 5561-78 (2015)
Article DOI: 10.1021/acs.jmedchem.5b00599
BindingDB Entry DOI: 10.7270/Q26T0PCZ
Monoamine Oxidase Type B (MAO-B)
(Rattus norvegicus (rat))
BDBM50093227
(CHEMBL3586608)
Show SMILES Cl.CN(Cc1ccccc1)Cc1ccc(COc2ccc3c(CO)cc(=O)oc3c2)cc1
Show InChI InChI=1S/C17H13NO/c1-11-15-4-2-3-13-7-10-16(18(13)15)17(11)12-5-8-14(19)9-6-12/h2-10,19H,1H3
n/an/a 410n/an/an/an/an/an/a
Universit£ degli Studi di Bari"Aldo Moro"
Curated by ChEMBL
Assay Description
Inhibition of rat brain MAO-B using kynuramine substrate in rat mitochondrial substrate by spectrophotometric assay
J Med Chem 58: 5561-78 (2015)
Article DOI: 10.1021/acs.jmedchem.5b00599
BindingDB Entry DOI: 10.7270/Q26T0PCZ