BDBM50093321 4-{4-[5-(2,6-Dimethyl-piperidin-1-yl)-pentyl]-3-oxo-3,4-dihydro-2H-benzo[1,4]oxazin-2-yl}-N-hydroxy-benzamidine::CHEMBL130967
SMILES: CC1CCCC(C)N1CCCCCN1C(=O)C(Oc2ccccc12)c1ccc(cc1)C(=N)NO
InChI Key: InChIKey=KXHZDNSGEHMLAL-UHFFFAOYSA-N
Data: 1 IC50
Activity Spreadsheet -- Enzyme Inhibition Constant Data from BindingDB
Found 1 hit for monomerid = 50093321
Trg + Lig
Ki
nM
ΔG°
kcal/mole
IC50
nM
Kd
nM
EC50/IC50
nM
koff
s-1
kon
M-1s-1
pHTemp
°C
Coagulation factor X
(Homo sapiens (Human))
BDBM50093321
(4-{4-[5-(2,6-Dimethyl-piperidin-1-yl)-pentyl]-3-ox...)
Show SMILES CC1CCCC(C)N1CCCCCN1C(=O)C(Oc2ccccc12)c1ccc(cc1)C(=N)NO
Show InChI InChI=1S/C27H36N4O3/c1-19-9-8-10-20(2)30(19)17-6-3-7-18-31-23-11-4-5-12-24(23)34-25(27(31)32)21-13-15-22(16-14-21)26(28)29-33/h4-5,11-16,19-20,25,33H,3,6-10,17-18H2,1-2H3,(H2,28,29)
Reactome pathway
n/an/a 6.60E+4n/an/an/an/an/an/a
Pfizer Global Research and Development
Curated by ChEMBL
Assay Description
In vitro inhibition of coagulation factor Xa.
J Med Chem 43: 4063-70 (2000)
BindingDB Entry DOI: 10.7270/Q2W66K1H