BDBM50093459 CHEMBL3586712
SMILES: Cc1cc2ccnc(NCC3CCCNC3)c2[nH]c1=O
InChI Key: InChIKey=GINUCGDQKMDJTD-UINJJDOFSA-N
Data: 2 IC50
Activity Spreadsheet -- Enzyme Inhibition Constant Data from BindingDB
Found 2 hits for monomerid = 50093459
Trg + Lig
Ki
nM
ΔG°
kcal/mole
IC50
nM
Kd
nM
EC50/IC50
nM
koff
s-1
kon
M-1s-1
pHTemp
°C
ATPase family AAA domain-containing protein 2
(Homo sapiens (Human))
BDBM50093459
(CHEMBL3586712)
Show SMILES Cc1cc2ccnc(NCC3CCCNC3)c2[nH]c1=O
Show InChI InChI=1S/C21H22N6O4/c22-21-25-18(23-8-12-6-3-5-11-4-1-2-7-13(11)12)15-19(26-21)27(10-24-15)20-17(30)16(29)14(9-28)31-20/h1-7,10,14,16-17,20,28-30H,8-9H2,(H3,22,23,25,26)/t14?,16-,17-,20?/m0/s1
n/an/a 3.98E+4n/an/an/an/an/an/a
GlaxoSmithKline
Curated by ChEMBL
Assay Description
Displacement of histone H4 peptide from FLAG-6His-Tev-ATAD2 (981 to 1121) (unknown origin) expressed in Escherichia coli BL21 (DE3) after 30 mins by ...
J Med Chem 58: 5649-73 (2015)
Article DOI: 10.1021/acs.jmedchem.5b00772
BindingDB Entry DOI: 10.7270/Q2PR7XQN
Bromodomain-containing protein 4
(Homo sapiens (Human))
BDBM50093459
(CHEMBL3586712)
Show SMILES Cc1cc2ccnc(NCC3CCCNC3)c2[nH]c1=O
Show InChI InChI=1S/C21H22N6O4/c22-21-25-18(23-8-12-6-3-5-11-4-1-2-7-13(11)12)15-19(26-21)27(10-24-15)20-17(30)16(29)14(9-28)31-20/h1-7,10,14,16-17,20,28-30H,8-9H2,(H3,22,23,25,26)/t14?,16-,17-,20?/m0/s1
n/an/a 6.31E+3n/an/an/an/an/an/a
GlaxoSmithKline
Curated by ChEMBL
Assay Description
Displacement of I-BET762 from 6His-Thr-BRD4 (1 to 477) BD1 (unknown origin) harboring BD2 Y390A mutant after 30 mins by TR-FRET analysis
J Med Chem 58: 5649-73 (2015)
Article DOI: 10.1021/acs.jmedchem.5b00772
BindingDB Entry DOI: 10.7270/Q2PR7XQN