BDBM50093467 CHEMBL3586694
SMILES: COCCNc1cccc2cc(C)c(=O)[nH]c12
InChI Key: InChIKey=XGIMEDAMLNPVHR-GYDJVJMJSA-N
Data: 2 IC50
Activity Spreadsheet -- Enzyme Inhibition Constant Data from BindingDB
Found 2 hits for monomerid = 50093467
Trg + Lig
Ki
nM
ΔG°
kcal/mole
IC50
nM
Kd
nM
EC50/IC50
nM
koff
s-1
kon
M-1s-1
pHTemp
°C
ATPase family AAA domain-containing protein 2
(Homo sapiens (Human))
BDBM50093467
(CHEMBL3586694)
Show SMILES COCCNc1cccc2cc(C)c(=O)[nH]c12
Show InChI InChI=1S/C18H22N6O5/c19-15-12-16(24(8-21-12)17-14(28)13(27)11(7-25)29-17)23-18(22-15)20-6-10(26)9-4-2-1-3-5-9/h1-5,8,10-11,13-14,17,25-28H,6-7H2,(H3,19,20,22,23)/t10?,11?,13-,14-,17?/m0/s1
n/an/a<1.00E+5n/an/an/an/an/an/a
GlaxoSmithKline
Curated by ChEMBL
Assay Description
Displacement of histone H4 peptide from FLAG-6His-Tev-ATAD2 (981 to 1121) (unknown origin) expressed in Escherichia coli BL21 (DE3) after 30 mins by ...
J Med Chem 58: 5649-73 (2015)
Article DOI: 10.1021/acs.jmedchem.5b00772
BindingDB Entry DOI: 10.7270/Q2PR7XQN
Bromodomain-containing protein 4
(Homo sapiens (Human))
BDBM50093467
(CHEMBL3586694)
Show SMILES COCCNc1cccc2cc(C)c(=O)[nH]c12
Show InChI InChI=1S/C18H22N6O5/c19-15-12-16(24(8-21-12)17-14(28)13(27)11(7-25)29-17)23-18(22-15)20-6-10(26)9-4-2-1-3-5-9/h1-5,8,10-11,13-14,17,25-28H,6-7H2,(H3,19,20,22,23)/t10?,11?,13-,14-,17?/m0/s1
n/an/a<5.01E+4n/an/an/an/an/an/a
GlaxoSmithKline
Curated by ChEMBL
Assay Description
Displacement of I-BET762 from 6His-Thr-BRD4 (1 to 477) BD1 (unknown origin) harboring BD2 Y390A mutant after 30 mins by TR-FRET analysis
J Med Chem 58: 5649-73 (2015)
Article DOI: 10.1021/acs.jmedchem.5b00772
BindingDB Entry DOI: 10.7270/Q2PR7XQN