BDBM50093582 CHEMBL3585782
SMILES: COc1ccc(cc1OC)C(C)NS(N)(=O)=O
InChI Key: InChIKey=XRTLNGOFVMCPQN-UHFFFAOYSA-N
Data: 3 KI  1 IC50
Activity Spreadsheet -- Enzyme Inhibition Constant Data from BindingDB
Found 4 hits for monomerid = 50093582
Trg + Lig
Ki
nM
ΔG°
kcal/mole
IC50
nM
Kd
nM
EC50/IC50
nM
koff
s-1
kon
M-1s-1
pHTemp
°C
Acetylcholinesterase
(Homo sapiens (Human))
BDBM50093582
(CHEMBL3585782)
Show SMILES COc1ccc(cc1OC)C(C)NS(N)(=O)=O
Show InChI InChI=1S/C10H16N2O4S/c1-7(12-17(11,13)14)8-4-5-9(15-2)10(6-8)16-3/h4-7,12H,1-3H3,(H2,11,13,14)
NCI pathway
Reactome pathway
4.90n/an/an/an/an/an/an/an/a
AgriIbrahim£e£en University
Curated by ChEMBL
Assay Description
Inhibition of esterase activity of carbonic anhydrase 1 in human erythrocytes using PNF as substrate by spectrophotometer analysis
Bioorg Med Chem 23: 3592-602 (2015)
Article DOI: 10.1016/j.bmc.2015.04.019
BindingDB Entry DOI: 10.7270/Q2J104XP
Carbonic anhydrase 2
(Homo sapiens (Human))
BDBM50093582
(CHEMBL3585782)
Show SMILES COc1ccc(cc1OC)C(C)NS(N)(=O)=O
Show InChI InChI=1S/C10H16N2O4S/c1-7(12-17(11,13)14)8-4-5-9(15-2)10(6-8)16-3/h4-7,12H,1-3H3,(H2,11,13,14)
Reactome pathway
454n/an/an/an/an/an/an/an/a
AgriIbrahim£e£en University
Curated by ChEMBL
Assay Description
Inhibition of acetylcholinesterase (unknown origin) assessed as AChI hydrolysis using AChI and DTNB as substrate by Ellman's method
Bioorg Med Chem 23: 3592-602 (2015)
Article DOI: 10.1016/j.bmc.2015.04.019
BindingDB Entry DOI: 10.7270/Q2J104XP
Carbonic anhydrase 1
(Homo sapiens (Human))
BDBM50093582
(CHEMBL3585782)
Show SMILES COc1ccc(cc1OC)C(C)NS(N)(=O)=O
Show InChI InChI=1S/C10H16N2O4S/c1-7(12-17(11,13)14)8-4-5-9(15-2)10(6-8)16-3/h4-7,12H,1-3H3,(H2,11,13,14)
NCI pathway
Reactome pathway
657n/an/an/an/an/an/an/an/a
AgriIbrahim£e£en University
Curated by ChEMBL
Assay Description
Inhibition of esterase activity of carbonic anhydrase 1 in human erythrocytes using PNF as substrate by spectrophotometer analysis
Bioorg Med Chem 23: 3592-602 (2015)
Article DOI: 10.1016/j.bmc.2015.04.019
BindingDB Entry DOI: 10.7270/Q2J104XP
Acetylcholinesterase
(Homo sapiens (Human))
BDBM50093582
(CHEMBL3585782)
Show SMILES COc1ccc(cc1OC)C(C)NS(N)(=O)=O
Show InChI InChI=1S/C10H16N2O4S/c1-7(12-17(11,13)14)8-4-5-9(15-2)10(6-8)16-3/h4-7,12H,1-3H3,(H2,11,13,14)
NCI pathway
Reactome pathway
n/an/a 27n/an/an/an/an/an/a
AgriIbrahim£e£en University
Curated by ChEMBL
Assay Description
Inhibition of esterase activity of carbonic anhydrase 1 in human erythrocytes using PNF as substrate by spectrophotometer analysis
Bioorg Med Chem 23: 3592-602 (2015)
Article DOI: 10.1016/j.bmc.2015.04.019
BindingDB Entry DOI: 10.7270/Q2J104XP