BDBM50093694 CHEMBL3585843
SMILES: NNC(=O)CCCN1C(Nc2ccccc2C1=O)c1ccco1
InChI Key: InChIKey=MJKQJDLIJYSONA-UHFFFAOYSA-N
Data: 2 IC50
Activity Spreadsheet -- Enzyme Inhibition Constant Data from BindingDB
Found 2 hits for monomerid = 50093694
Trg + Lig
Ki
nM
ΔG°
kcal/mole
IC50
nM
Kd
nM
EC50/IC50
nM
koff
s-1
kon
M-1s-1
pHTemp
°C
Monoamine oxidase B
(Bos taurus)
BDBM50093694
(CHEMBL3585843)
Show SMILES NNC(=O)CCCN1C(Nc2ccccc2C1=O)c1ccco1
Show InChI InChI=1S/C18H19ClN4/c1-12-20-16-11-15(13-5-7-14(19)8-6-13)22-17(16)18(21-12)23-9-3-2-4-10-23/h5-8,11,22H,2-4,9-10H2,1H3
Reactome pathway
n/an/a 2.70n/an/an/an/an/an/a
Alexandria University
Curated by ChEMBL
Assay Description
Inhibition of bovine brain mitochondria MAO-B using benzylamine substrate after 60 mins by fluorimetric method
Bioorg Med Chem 23: 3574-85 (2015)
Article DOI: 10.1016/j.bmc.2015.04.021
BindingDB Entry DOI: 10.7270/Q28K7BVZ
Monoamine oxidase A
(Bos taurus)
BDBM50093694
(CHEMBL3585843)
Show SMILES NNC(=O)CCCN1C(Nc2ccccc2C1=O)c1ccco1
Show InChI InChI=1S/C18H19ClN4/c1-12-20-16-11-15(13-5-7-14(19)8-6-13)22-17(16)18(21-12)23-9-3-2-4-10-23/h5-8,11,22H,2-4,9-10H2,1H3
Reactome pathway
n/an/a 3.60n/an/an/an/an/an/a
Alexandria University
Curated by ChEMBL
Assay Description
Inhibition of bovine brain mitochondria MAO-A using serotonin substrate after 60 mins by fluorimetric method
Bioorg Med Chem 23: 3574-85 (2015)
Article DOI: 10.1016/j.bmc.2015.04.021
BindingDB Entry DOI: 10.7270/Q28K7BVZ