BDBM50093926 2-[2-(4-Fluoro-benzylsulfanyl)-4-oxo-5-pyrimidin-5-ylmethyl-4H-pyrimidin-1-yl]-N-((E)-octadec-9-enyl)-acetamide::CHEMBL87882
SMILES: CCCCCCCC\C=C\CCCCCCCCNC(=O)Cn1cc(Cc2cncnc2)c(=O)nc1SCc1ccc(F)cc1
InChI Key: InChIKey=YHOPZJHJUCQYMX-MDZDMXLPSA-N
Data: 1 IC50
Activity Spreadsheet -- Enzyme Inhibition Constant Data from BindingDB
Found 1 hit for monomerid = 50093926
Trg + Lig
Ki
nM
ΔG°
kcal/mole
IC50
nM
Kd
nM
EC50/IC50
nM
koff
s-1
kon
M-1s-1
pHTemp
°C
LDL-associated phospholipase A2
(Homo sapiens (Human))
BDBM50093926
(2-[2-(4-Fluoro-benzylsulfanyl)-4-oxo-5-pyrimidin-5...)
Show SMILES CCCCCCCC\C=C\CCCCCCCCNC(=O)Cn1cc(Cc2cncnc2)c(=O)nc1SCc1ccc(F)cc1
Show InChI InChI=1S/C36H50FN5O2S/c1-2-3-4-5-6-7-8-9-10-11-12-13-14-15-16-17-22-40-34(43)27-42-26-32(23-31-24-38-29-39-25-31)35(44)41-36(42)45-28-30-18-20-33(37)21-19-30/h9-10,18-21,24-26,29H,2-8,11-17,22-23,27-28H2,1H3,(H,40,43)/b10-9+
NCI pathway
Reactome pathway
n/an/a 2n/an/an/an/an/an/a
SmithKline Beecham Pharmaceuticals
Curated by ChEMBL
Assay Description
Inhibition of lipoprotein associated phospholipase A2 in human plasma
Bioorg Med Chem Lett 10: 2557-61 (2001)
BindingDB Entry DOI: 10.7270/Q2B857C6