BDBM50093985 2-(6-Carboxy-4H-benzo[1,3]dioxin-8-ylmethyl)-4-(6-chloro-benzo[1,3]dioxol-5-ylmethyl)-5-phenyl-2H-pyrazole-3-carboxylic acid::CHEMBL312854
SMILES: OC(=O)c1c(Cc2cc3OCOc3cc2Cl)c(nn1Cc1cc(cc2COCOc12)C(O)=O)-c1ccccc1
InChI Key: InChIKey=CNNRQVOYWFOJPP-UHFFFAOYSA-N
Data: 2 IC50
Activity Spreadsheet -- Enzyme Inhibition Constant Data from BindingDB
Found 2 hits for monomerid = 50093985
Trg + Lig
Ki
nM
ΔG°
kcal/mole
IC50
nM
Kd
nM
EC50/IC50
nM
koff
s-1
kon
M-1s-1
pHTemp
°C
EDNRA
(RAT)
BDBM50093985
(2-(6-Carboxy-4H-benzo[1,3]dioxin-8-ylmethyl)-4-(6-...)
Show SMILES OC(=O)c1c(Cc2cc3OCOc3cc2Cl)c(nn1Cc1cc(cc2COCOc12)C(O)=O)-c1ccccc1
Show InChI InChI=1S/C28H21ClN2O8/c29-21-10-23-22(37-14-38-23)9-16(21)8-20-24(15-4-2-1-3-5-15)30-31(25(20)28(34)35)11-18-6-17(27(32)33)7-19-12-36-13-39-26(18)19/h1-7,9-10H,8,11-14H2,(H,32,33)(H,34,35)
Reactome pathway
n/an/a 2.5n/an/an/an/an/an/a
Hoechst Marion Roussel
Curated by ChEMBL
Assay Description
In vitro binding affinity to endothelin A receptor in rat heart ventricles
Bioorg Med Chem Lett 10: 2575-8 (2001)
BindingDB Entry DOI: 10.7270/Q22R3QW9
EDNRB
(RAT)
BDBM50093985
(2-(6-Carboxy-4H-benzo[1,3]dioxin-8-ylmethyl)-4-(6-...)
Show SMILES OC(=O)c1c(Cc2cc3OCOc3cc2Cl)c(nn1Cc1cc(cc2COCOc12)C(O)=O)-c1ccccc1
Show InChI InChI=1S/C28H21ClN2O8/c29-21-10-23-22(37-14-38-23)9-16(21)8-20-24(15-4-2-1-3-5-15)30-31(25(20)28(34)35)11-18-6-17(27(32)33)7-19-12-36-13-39-26(18)19/h1-7,9-10H,8,11-14H2,(H,32,33)(H,34,35)
Reactome pathway
n/an/a 44n/an/an/an/an/an/a
Hoechst Marion Roussel
Curated by ChEMBL
Assay Description
In vitro binding affinity to endothelin B receptor in rat cerebellum
Bioorg Med Chem Lett 10: 2575-8 (2001)
BindingDB Entry DOI: 10.7270/Q22R3QW9