BDBM50093995 2-(2-Carboxymethoxy-cyclohexylmethyl)-4-(6-chloro-benzo[1,3]dioxol-5-ylmethyl)-5-phenyl-2H-pyrazole-3-carboxylic acid::CHEMBL314973
SMILES: OC(=O)COC1CCCCC1Cn1nc(c(Cc2cc3OCOc3cc2Cl)c1C(O)=O)-c1ccccc1
InChI Key: InChIKey=HDYKWOBJYYWUAM-UHFFFAOYSA-N
Data: 2 IC50
Activity Spreadsheet -- Enzyme Inhibition Constant Data from BindingDB
Found 2 hits for monomerid = 50093995
Trg + Lig
Ki
nM
ΔG°
kcal/mole
IC50
nM
Kd
nM
EC50/IC50
nM
koff
s-1
kon
M-1s-1
pHTemp
°C
EDNRA
(RAT)
BDBM50093995
(2-(2-Carboxymethoxy-cyclohexylmethyl)-4-(6-chloro-...)
Show SMILES OC(=O)COC1CCCCC1Cn1nc(c(Cc2cc3OCOc3cc2Cl)c1C(O)=O)-c1ccccc1
Show InChI InChI=1S/C27H27ClN2O7/c28-20-12-23-22(36-15-37-23)11-18(20)10-19-25(16-6-2-1-3-7-16)29-30(26(19)27(33)34)13-17-8-4-5-9-21(17)35-14-24(31)32/h1-3,6-7,11-12,17,21H,4-5,8-10,13-15H2,(H,31,32)(H,33,34)
Reactome pathway
n/an/a 21n/an/an/an/an/an/a
Hoechst Marion Roussel
Curated by ChEMBL
Assay Description
In vitro binding affinity to endothelin A receptor in rat heart ventricles
Bioorg Med Chem Lett 10: 2575-8 (2001)
BindingDB Entry DOI: 10.7270/Q22R3QW9
EDNRB
(RAT)
BDBM50093995
(2-(2-Carboxymethoxy-cyclohexylmethyl)-4-(6-chloro-...)
Show SMILES OC(=O)COC1CCCCC1Cn1nc(c(Cc2cc3OCOc3cc2Cl)c1C(O)=O)-c1ccccc1
Show InChI InChI=1S/C27H27ClN2O7/c28-20-12-23-22(36-15-37-23)11-18(20)10-19-25(16-6-2-1-3-7-16)29-30(26(19)27(33)34)13-17-8-4-5-9-21(17)35-14-24(31)32/h1-3,6-7,11-12,17,21H,4-5,8-10,13-15H2,(H,31,32)(H,33,34)
Reactome pathway
n/an/a 3.20n/an/an/an/an/an/a
Hoechst Marion Roussel
Curated by ChEMBL
Assay Description
In vitro binding affinity to endothelin B receptor in rat cerebellum
Bioorg Med Chem Lett 10: 2575-8 (2001)
BindingDB Entry DOI: 10.7270/Q22R3QW9