BDBM50094002 2-(3-Carboxy-benzyl)-4-(6-chloro-benzo[1,3]dioxol-5-ylmethyl)-5-thiophen-2-yl-2H-pyrazole-3-carboxylic acid::CHEMBL315638
SMILES: OC(=O)c1c(Cc2cc3OCOc3cc2Cl)c(nn1Cc1cccc(c1)C(O)=O)-c1cccs1
InChI Key: InChIKey=ZHDQUBQIHNVXSF-UHFFFAOYSA-N
Data: 2 IC50
Activity Spreadsheet -- Enzyme Inhibition Constant Data from BindingDB
Found 2 hits for monomerid = 50094002
Trg + Lig
Ki
nM
ΔG°
kcal/mole
IC50
nM
Kd
nM
EC50/IC50
nM
koff
s-1
kon
M-1s-1
pHTemp
°C
EDNRA
(RAT)
BDBM50094002
(2-(3-Carboxy-benzyl)-4-(6-chloro-benzo[1,3]dioxol-...)
Show SMILES OC(=O)c1c(Cc2cc3OCOc3cc2Cl)c(nn1Cc1cccc(c1)C(O)=O)-c1cccs1
Show InChI InChI=1S/C24H17ClN2O6S/c25-17-10-19-18(32-12-33-19)9-15(17)8-16-21(20-5-2-6-34-20)26-27(22(16)24(30)31)11-13-3-1-4-14(7-13)23(28)29/h1-7,9-10H,8,11-12H2,(H,28,29)(H,30,31)
Reactome pathway
n/an/a 6.20n/an/an/an/an/an/a
Hoechst Marion Roussel
Curated by ChEMBL
Assay Description
In vitro binding affinity to endothelin A receptor in rat heart ventricles
Bioorg Med Chem Lett 10: 2575-8 (2001)
BindingDB Entry DOI: 10.7270/Q22R3QW9
EDNRB
(RAT)
BDBM50094002
(2-(3-Carboxy-benzyl)-4-(6-chloro-benzo[1,3]dioxol-...)
Show SMILES OC(=O)c1c(Cc2cc3OCOc3cc2Cl)c(nn1Cc1cccc(c1)C(O)=O)-c1cccs1
Show InChI InChI=1S/C24H17ClN2O6S/c25-17-10-19-18(32-12-33-19)9-15(17)8-16-21(20-5-2-6-34-20)26-27(22(16)24(30)31)11-13-3-1-4-14(7-13)23(28)29/h1-7,9-10H,8,11-12H2,(H,28,29)(H,30,31)
Reactome pathway
n/an/a 89n/an/an/an/an/an/a
Hoechst Marion Roussel
Curated by ChEMBL
Assay Description
In vitro binding affinity to endothelin B receptor in rat cerebellum
Bioorg Med Chem Lett 10: 2575-8 (2001)
BindingDB Entry DOI: 10.7270/Q22R3QW9