BDBM50094058 CHEMBL263544::GSS(heptyl carbonyl)FLSPEHQ-NH2
SMILES: CCCCCCCC(=O)OC[C@H](NC(=O)[C@H](CO)NC(=O)CN)C(=O)N[C@@H](Cc1ccccc1)C(=O)N[C@@H](CC(C)C)C(=O)N[C@@H](CO)C(=O)N1CCC[C@@H]1C(=O)N[C@@H](CCC(O)=O)C(=O)N[C@@H](Cc1cnc[nH]1)C(=O)N[C@@H](CCC(N)=O)C(N)=O
InChI Key: InChIKey=IOAHTRURPQSGFQ-VIHQADHSSA-N
Data: 1 IC50
Activity Spreadsheet -- Enzyme Inhibition Constant Data from BindingDB
Found 1 hit for monomerid = 50094058
Trg + Lig
Ki
nM
ΔG°
kcal/mole
IC50
nM
Kd
nM
EC50/IC50
nM
koff
s-1
kon
M-1s-1
pHTemp
°C
Ghrelin receptor
(Homo sapiens (Human))
BDBM50094058
(CHEMBL263544 | GSS(heptyl carbonyl)FLSPEHQ-NH2)
Show SMILES CCCCCCCC(=O)OC[C@H](NC(=O)[C@H](CO)NC(=O)CN)C(=O)N[C@@H](Cc1ccccc1)C(=O)N[C@@H](CC(C)C)C(=O)N[C@@H](CO)C(=O)N1CCC[C@@H]1C(=O)N[C@@H](CCC(O)=O)C(=O)N[C@@H](Cc1cnc[nH]1)C(=O)N[C@@H](CCC(N)=O)C(N)=O
Show InChI InChI=1S/C55H84N14O17/c1-4-5-6-7-11-16-46(76)86-29-41(68-52(82)39(27-70)61-44(73)25-56)53(83)65-37(23-32-13-9-8-10-14-32)50(80)64-36(22-31(2)3)49(79)67-40(28-71)55(85)69-21-12-15-42(69)54(84)63-35(18-20-45(74)75)48(78)66-38(24-33-26-59-30-60-33)51(81)62-34(47(58)77)17-19-43(57)72/h8-10,13-14,26,30-31,34-42,70-71H,4-7,11-12,15-25,27-29,56H2,1-3H3,(H2,57,72)(H2,58,77)(H,59,60)(H,61,73)(H,62,81)(H,63,84)(H,64,80)(H,65,83)(H,66,78)(H,67,79)(H,68,82)(H,74,75)/t34-,35-,36-,37-,38-,39-,40-,41-,42+/m0/s1
Reactome pathway
n/an/a 7.10n/an/an/an/an/an/a
Merck Research Laboratories
Curated by ChEMBL
Assay Description
Binding affinity to cloned human growth hormone secretagogue receptor type 1 in a competitive binding assay with [35S]-MK-0677 as a radiolabeled liga...
J Med Chem 43: 4370-6 (2000)
BindingDB Entry DOI: 10.7270/Q2T72GP0