BDBM50094726 3-{13-Hydroxy-2-hydroxyimino-13-[5'-(1-hydroxyimino-undecyl)-octahydro-[2,2']bifuranyl-5-yl]-tridecyl}-5-methyl-5H-furan-2-one(4,24-didehydroxy-4,24-dihydroxyliminorolliniastatin-1)::CHEMBL358586
SMILES: CCCCCCCCCCC(N=O)[C@H]1CC[C@H](O1)[C@@H]1CC[C@@H](O1)[C@H](O)CCCCCCCCCCC(CC1=C[C@H](C)OC1=O)N=O
InChI Key: InChIKey=UJWUNOLCKBLQII-MKAJQWJDSA-N
Data: 1 IC50
Activity Spreadsheet -- Enzyme Inhibition Constant Data from BindingDB
Found 1 hit for monomerid = 50094726
Trg + Lig
Ki
nM
ΔG°
kcal/mole
IC50
nM
Kd
nM
EC50/IC50
nM
koff
s-1
kon
M-1s-1
pHTemp
°C
Acyl carrier protein,/NADH dehydrogenase [ubiquinone] flavoprotein 1, mitochondrial
(Bos taurus)
BDBM50094726
(3-{13-Hydroxy-2-hydroxyimino-13-[5'-(1-hydroxyimin...)
Show SMILES CCCCCCCCCCC(N=O)[C@H]1CC[C@H](O1)[C@@H]1CC[C@@H](O1)[C@H](O)CCCCCCCCCCC(CC1=C[C@H](C)OC1=O)N=O |t:39|
Show InChI InChI=1S/C37H64N2O7/c1-3-4-5-6-7-11-14-17-20-31(39-43)33-22-24-35(45-33)36-25-23-34(46-36)32(40)21-18-15-12-9-8-10-13-16-19-30(38-42)27-29-26-28(2)44-37(29)41/h26,28,30-36,40H,3-25,27H2,1-2H3/t28-,30?,31?,32+,33+,34+,35-,36-/m0/s1
n/an/a 0.340n/an/an/an/an/an/a
Universidad de Valencia
Curated by ChEMBL
Assay Description
Inhibition of NADH oxidase activity.
J Med Chem 43: 4793-800 (2000)
BindingDB Entry DOI: 10.7270/Q2FN16WQ