BDBM50094729 3-{13-Hydroxy-13-[5'-(1-hydroxy-5-oxo-undecyl)-octahydro-[2,2']bifuranyl-5-yl]-tridecyl}-5-methyl-5H-furan-2-one(28-dehydroxy-28-oxosquamocin)::CHEMBL357666
SMILES: CCCCCCC(=O)CCC[C@H](O)[C@H]1CC[C@@H](O1)[C@H]1CC[C@@H](O1)[C@H](O)CCCCCCCCCCCCC1=C[C@H](C)OC1=O
InChI Key: InChIKey=UXAFVVQVJFYYBS-QJUHSENFSA-N
Data: 1 IC50
Activity Spreadsheet -- Enzyme Inhibition Constant Data from BindingDB
Found 1 hit for monomerid = 50094729
Trg + Lig
Ki
nM
ΔG°
kcal/mole
IC50
nM
Kd
nM
EC50/IC50
nM
koff
s-1
kon
M-1s-1
pHTemp
°C
Mitochondrial complex I; NADH oxidoreductase
(Bos taurus)
BDBM50094729
(3-{13-Hydroxy-13-[5'-(1-hydroxy-5-oxo-undecyl)-oct...)
Show SMILES CCCCCCC(=O)CCC[C@H](O)[C@H]1CC[C@@H](O1)[C@H]1CC[C@@H](O1)[C@H](O)CCCCCCCCCCCCC1=C[C@H](C)OC1=O |t:39|
Show InChI InChI=1S/C37H64O7/c1-3-4-5-15-19-30(38)20-17-22-32(40)34-24-26-36(44-34)35-25-23-33(43-35)31(39)21-16-13-11-9-7-6-8-10-12-14-18-29-27-28(2)42-37(29)41/h27-28,31-36,39-40H,3-26H2,1-2H3/t28-,31+,32-,33+,34+,35+,36+/m0/s1
n/an/a 0.650n/an/an/an/an/an/a
Universidad de Valencia
Curated by ChEMBL
Assay Description
Inhibition of NADH oxidase activity.
J Med Chem 43: 4793-800 (2000)
BindingDB Entry DOI: 10.7270/Q2FN16WQ