BDBM50095203 CHEMBL94751::[(S)-6-(3-Benzhydryl-6-oxo-6H-pyridazin-1-ylmethyl)-5,6,7,8-tetrahydro-naphthalen-1-yloxy]-acetic acid
SMILES: OC(=O)COc1cccc2C[C@@H](Cn3nc(ccc3=O)C(c3ccccc3)c3ccccc3)CCc12
InChI Key: InChIKey=FFRFCEJVGONUHG-NRFANRHFSA-N
Data: 1 KI  2 IC50
Activity Spreadsheet -- Enzyme Inhibition Constant Data from BindingDB
Found 3 hits for monomerid = 50095203
Trg + Lig
Ki
nM
ΔG°
kcal/mole
IC50
nM
Kd
nM
EC50/IC50
nM
koff
s-1
kon
M-1s-1
pHTemp
°C
Prostanoid IP receptor
(Homo sapiens (Human))
BDBM50095203
(CHEMBL94751 | [(S)-6-(3-Benzhydryl-6-oxo-6H-pyrida...)
Show SMILES OC(=O)COc1cccc2C[C@@H](Cn3nc(ccc3=O)C(c3ccccc3)c3ccccc3)CCc12
Show InChI InChI=1S/C30H28N2O4/c33-28-17-16-26(30(22-8-3-1-4-9-22)23-10-5-2-6-11-23)31-32(28)19-21-14-15-25-24(18-21)12-7-13-27(25)36-20-29(34)35/h1-13,16-17,21,30H,14-15,18-20H2,(H,34,35)/t21-/m0/s1
NCI pathway
Reactome pathway
94n/an/an/an/an/an/an/an/a
Fujisawa Pharmaceutical Co., Ltd
Curated by ChEMBL
Assay Description
Tested for inhibition of 3[H]-iloprost binding to human IP receptor
Bioorg Med Chem Lett 10: 2787-90 (2000)
BindingDB Entry DOI: 10.7270/Q26972TT
Prostanoid IP receptor
(Homo sapiens (Human))
BDBM50095203
(CHEMBL94751 | [(S)-6-(3-Benzhydryl-6-oxo-6H-pyrida...)
Show SMILES OC(=O)COc1cccc2C[C@@H](Cn3nc(ccc3=O)C(c3ccccc3)c3ccccc3)CCc12
Show InChI InChI=1S/C30H28N2O4/c33-28-17-16-26(30(22-8-3-1-4-9-22)23-10-5-2-6-11-23)31-32(28)19-21-14-15-25-24(18-21)12-7-13-27(25)36-20-29(34)35/h1-13,16-17,21,30H,14-15,18-20H2,(H,34,35)/t21-/m0/s1
NCI pathway
Reactome pathway
n/an/a 81n/an/an/an/an/an/a
TBA
Assay Description
Agonist activity at PGI2 receptor in Homo sapiens (human) platelets assessed as inhibition of ADP-induced aggregation
Citation and Details
Article DOI: 10.1007/s00044-012-0261-1
BindingDB Entry DOI: 10.7270/Q2VX0KD3
Prostanoid IP receptor
(Homo sapiens (Human))
BDBM50095203
(CHEMBL94751 | [(S)-6-(3-Benzhydryl-6-oxo-6H-pyrida...)
Show SMILES OC(=O)COc1cccc2C[C@@H](Cn3nc(ccc3=O)C(c3ccccc3)c3ccccc3)CCc12
Show InChI InChI=1S/C30H28N2O4/c33-28-17-16-26(30(22-8-3-1-4-9-22)23-10-5-2-6-11-23)31-32(28)19-21-14-15-25-24(18-21)12-7-13-27(25)36-20-29(34)35/h1-13,16-17,21,30H,14-15,18-20H2,(H,34,35)/t21-/m0/s1
NCI pathway
Reactome pathway
n/an/a 81n/an/an/an/an/an/a
Jamia Hamdard
Curated by ChEMBL
Assay Description
Agonist activity at PGI2 in human platelet-rich plasma assessed as inhibition of ADP-induced platelet aggregation
Eur J Med Chem 123: 256-281 (2016)
Article DOI: 10.1016/j.ejmech.2016.07.061
BindingDB Entry DOI: 10.7270/Q2Q81G2Z