BDBM50095252 (S)-2-[((S)-1-Benzyl-5-oxo-pyrrolidine-2-carbonyl)-amino]-3-[4-(2,6-dichloro-benzoylamino)-phenyl]-propionic acid::CHEMBL131284
SMILES: OC(=O)[C@H](Cc1ccc(NC(=O)c2c(Cl)cccc2Cl)cc1)NC(=O)[C@@H]1CCC(=O)N1Cc1ccccc1
InChI Key: InChIKey=WRHKZVFBIZOZCV-GOTSBHOMSA-N
Data: 1 IC50
Activity Spreadsheet -- Enzyme Inhibition Constant Data from BindingDB
Found 1 hit for monomerid = 50095252
Trg + Lig
Ki
nM
ΔG°
kcal/mole
IC50
nM
Kd
nM
EC50/IC50
nM
koff
s-1
kon
M-1s-1
pHTemp
°C
Fibronectin receptor beta/Integrin alpha-4
(Homo sapiens (Human))
BDBM50095252
((S)-2-[((S)-1-Benzyl-5-oxo-pyrrolidine-2-carbonyl)...)
Show SMILES OC(=O)[C@H](Cc1ccc(NC(=O)c2c(Cl)cccc2Cl)cc1)NC(=O)[C@@H]1CCC(=O)N1Cc1ccccc1
Show InChI InChI=1S/C28H25Cl2N3O5/c29-20-7-4-8-21(30)25(20)27(36)31-19-11-9-17(10-12-19)15-22(28(37)38)32-26(35)23-13-14-24(34)33(23)16-18-5-2-1-3-6-18/h1-12,22-23H,13-16H2,(H,31,36)(H,32,35)(H,37,38)/t22-,23-/m0/s1
Reactome pathway
n/an/a 0.370n/an/an/an/an/an/a
Hoffmann-La Roche Inc.
Curated by ChEMBL
Assay Description
Antagonistic activity against VLA-4 (derived from ramos cells) binding to recombinant human VCAM by ELISA assay
Bioorg Med Chem Lett 11: 1-4 (2001)
BindingDB Entry DOI: 10.7270/Q2MS3V2H