BDBM50095353 CHEMBL3589031
SMILES: CNCCN(C)Cc1cn[nH]c1-c1ccc(OC(C)C)c(Cl)c1
InChI Key: InChIKey=PMGPJYJFQITHHT-UHFFFAOYSA-N
Data: 3 IC50
Activity Spreadsheet -- Enzyme Inhibition Constant Data from BindingDB
Found 3 hits for monomerid = 50095353
Trg + Lig
Ki
nM
ΔG°
kcal/mole
IC50
nM
Kd
nM
EC50/IC50
nM
koff
s-1
kon
M-1s-1
pHTemp
°C
Protein-arginine N-methyltransferase 1
(Homo sapiens (Human))
BDBM50095353
(CHEMBL3589031)
Show SMILES CNCCN(C)Cc1cn[nH]c1-c1ccc(OC(C)C)c(Cl)c1
Show InChI InChI=1S/C17H25ClN4O/c1-12(2)23-16-6-5-13(9-15(16)18)17-14(10-20-21-17)11-22(4)8-7-19-3/h5-6,9-10,12,19H,7-8,11H2,1-4H3,(H,20,21)
n/an/a 5n/an/an/an/an/an/a
Epizyme, Inc.
Curated by ChEMBL
Assay Description
Inhibition of N-terminal GST tagged full-length human PRMT1 expressed in high five insect cells pre-incubated for 30 mins before addition of a [3H]SA...
ACS Med Chem Lett 6: 655-9 (2015)
Article DOI: 10.1021/acsmedchemlett.5b00071
BindingDB Entry DOI: 10.7270/Q20003V2
Protein arginine N-methyltransferase 6
(Homo sapiens (Human))
BDBM50095353
(CHEMBL3589031)
Show SMILES CNCCN(C)Cc1cn[nH]c1-c1ccc(OC(C)C)c(Cl)c1
Show InChI InChI=1S/C17H25ClN4O/c1-12(2)23-16-6-5-13(9-15(16)18)17-14(10-20-21-17)11-22(4)8-7-19-3/h5-6,9-10,12,19H,7-8,11H2,1-4H3,(H,20,21)
n/an/a 10n/an/an/an/an/an/a
Epizyme, Inc.
Curated by ChEMBL
Assay Description
Inhibition of FLAG and hexa-histidine tagged full-length human PRMT6 expressed in HEK293F cells pre-incubated for 30 mins before addition of a [3H]SA...
ACS Med Chem Lett 6: 655-9 (2015)
Article DOI: 10.1021/acsmedchemlett.5b00071
BindingDB Entry DOI: 10.7270/Q20003V2
Protein arginine methyltransferase 8 (PRMT8)
(Homo sapiens (Human))
BDBM50095353
(CHEMBL3589031)
Show SMILES CNCCN(C)Cc1cn[nH]c1-c1ccc(OC(C)C)c(Cl)c1
Show InChI InChI=1S/C17H25ClN4O/c1-12(2)23-16-6-5-13(9-15(16)18)17-14(10-20-21-17)11-22(4)8-7-19-3/h5-6,9-10,12,19H,7-8,11H2,1-4H3,(H,20,21)
n/an/a 10n/an/an/an/an/an/a
Epizyme, Inc.
Curated by ChEMBL
Assay Description
Inhibition of N-terminal GST tagged full-length human PRMT8 expressed in Escherichia coli (BL21(DE3) pre-incubated for 30 mins before addition of a [...
ACS Med Chem Lett 6: 655-9 (2015)
Article DOI: 10.1021/acsmedchemlett.5b00071
BindingDB Entry DOI: 10.7270/Q20003V2