BDBM50095474 CHEMBL3590478::US10329294, Example 2
SMILES: Cn1cc(NC(=O)c2cnn3ccc(N[C@@H]4CCCC[C@@H]4N)nc23)c(n1)C(F)(F)F
InChI Key: InChIKey=KMUHJPGOMYFEPW-UHFFFAOYSA-N
Data: 4 IC50
PDB links: 1 PDB ID matches this monomer.
Activity Spreadsheet -- Enzyme Inhibition Constant Data from BindingDB
Found 4 hits for monomerid = 50095474
Trg + Lig
Ki
nM
ΔG°
kcal/mole
IC50
nM
Kd
nM
EC50/IC50
nM
koff
s-1
kon
M-1s-1
pHTemp
°C
Interleukin-1 receptor-associated kinase 4
(Homo sapiens (Human))
BDBM50095474
(CHEMBL3590478 | US10329294, Example 2)
Show SMILES Cn1cc(NC(=O)c2cnn3ccc(N[C@@H]4CCCC[C@@H]4N)nc23)c(n1)C(F)(F)F |r|
Show InChI InChI=1S/C20H23N3O/c1-22(2)14-9-15-24-20-16-19(17-10-5-3-6-11-17)23(21-20)18-12-7-4-8-13-18/h3-8,10-13,16H,9,14-15H2,1-2H3
Reactome pathway
n/an/a 0.300n/an/an/an/an/an/a
Merck& Co.
Curated by ChEMBL
Assay Description
Inhibition of human IRAK4 assessed as phosphorylation of fluorescent peptide substrate after 30 mins by fluorescent polarization reader
ACS Med Chem Lett 6: 683-8 (2015)
Article DOI: 10.1021/acsmedchemlett.5b00107
BindingDB Entry DOI: 10.7270/Q2QF8VNH
3D
3D Structure (crystal)
Interleukin-1 receptor-associated kinase 4
(Homo sapiens (Human))
BDBM50095474
(CHEMBL3590478 | US10329294, Example 2)
Show SMILES Cn1cc(NC(=O)c2cnn3ccc(N[C@@H]4CCCC[C@@H]4N)nc23)c(n1)C(F)(F)F |r|
Show InChI InChI=1S/C20H23N3O/c1-22(2)14-9-15-24-20-16-19(17-10-5-3-6-11-17)23(21-20)18-12-7-4-8-13-18/h3-8,10-13,16H,9,14-15H2,1-2H3
Reactome pathway
US Patent
n/an/a 0.5n/an/an/an/an/an/a
Vernalis (R&D) Ltd
Assay Description
The kinase activity of IRAK4 is determined by its ability to catalyze the phosphorylation of a fluorescent polypeptide substrate. The extent of phosp...
Bioorg Med Chem 17: 6590-605 (2009)
BindingDB Entry DOI: 10.7270/Q2V40XJ3
3D
3D Structure (crystal)
Interleukin-1 receptor-associated kinase 4
(Homo sapiens (Human))
BDBM50095474
(CHEMBL3590478 | US10329294, Example 2)
Show SMILES Cn1cc(NC(=O)c2cnn3ccc(N[C@@H]4CCCC[C@@H]4N)nc23)c(n1)C(F)(F)F |r|
Show InChI InChI=1S/C20H23N3O/c1-22(2)14-9-15-24-20-16-19(17-10-5-3-6-11-17)23(21-20)18-12-7-4-8-13-18/h3-8,10-13,16H,9,14-15H2,1-2H3
Reactome pathway
n/an/a 9n/an/an/an/an/an/a
Merck Research Laboratories
Curated by ChEMBL
Assay Description
Inhibition of IRAK4 in human PBMC
Bioorg Med Chem Lett 25: 5384-8 (2015)
BindingDB Entry DOI: 10.7270/Q2WS8W3R
3D
3D Structure (crystal)
Interleukin-1 receptor-associated kinase 4
(Homo sapiens (Human))
BDBM50095474
(CHEMBL3590478 | US10329294, Example 2)
Show SMILES Cn1cc(NC(=O)c2cnn3ccc(N[C@@H]4CCCC[C@@H]4N)nc23)c(n1)C(F)(F)F |r|
Show InChI InChI=1S/C20H23N3O/c1-22(2)14-9-15-24-20-16-19(17-10-5-3-6-11-17)23(21-20)18-12-7-4-8-13-18/h3-8,10-13,16H,9,14-15H2,1-2H3
Reactome pathway
n/an/a 0.300n/an/an/an/an/an/a
Merck Research Laboratories
Curated by ChEMBL
Assay Description
Inhibition of IRAK4 (unknown origin)
Bioorg Med Chem Lett 25: 5384-8 (2015)
BindingDB Entry DOI: 10.7270/Q2WS8W3R
3D
3D Structure (crystal)