BDBM50095488 1,3-Dihydro-pyrrolo[3,4-b]quinoline-2-carbonitrile::CHEMBL8517
SMILES: N#CN1Cc2cc3ccccc3nc2C1
InChI Key: InChIKey=KLQYVOXLSMHROZ-UHFFFAOYSA-N
Data: 1 KI  9 IC50
Activity Spreadsheet -- Enzyme Inhibition Constant Data from BindingDB
Found 10 hits for monomerid = 50095488
Trg + Lig
Ki
nM
ΔG°
kcal/mole
IC50
nM
Kd
nM
EC50/IC50
nM
koff
s-1
kon
M-1s-1
pHTemp
°C
Cathepsin K
(Homo sapiens (Human))
BDBM50095488
(1,3-Dihydro-pyrrolo[3,4-b]quinoline-2-carbonitrile...)
Show SMILES N#CN1Cc2cc3ccccc3nc2C1
Show InChI InChI=1S/C12H9N3/c13-8-15-6-10-5-9-3-1-2-4-11(9)14-12(10)7-15/h1-5H,6-7H2
Reactome pathway
380n/an/an/an/an/an/an/an/a
Merck Frosst Centre for Therapeutic Research
Curated by ChEMBL
Assay Description
Inhibitory constant of the compound against human cathepsin K
J Med Chem 44: 94-104 (2001)
BindingDB Entry DOI: 10.7270/Q2DV1J4R
Procathepsin L
(Homo sapiens (Human))
BDBM50095488
(1,3-Dihydro-pyrrolo[3,4-b]quinoline-2-carbonitrile...)
Show SMILES N#CN1Cc2cc3ccccc3nc2C1
Show InChI InChI=1S/C12H9N3/c13-8-15-6-10-5-9-3-1-2-4-11(9)14-12(10)7-15/h1-5H,6-7H2
Reactome pathway
n/an/a 450n/an/an/an/an/an/a
Merck Frosst Centre for Therapeutic Research
Curated by ChEMBL
Assay Description
Inhibitory activity tested against Human Cathepsin L using Z-Phe-Arg-pNA as substrate
J Med Chem 44: 94-104 (2001)
BindingDB Entry DOI: 10.7270/Q2DV1J4R
Cathepsin K
(Homo sapiens (Human))
BDBM50095488
(1,3-Dihydro-pyrrolo[3,4-b]quinoline-2-carbonitrile...)
Show SMILES N#CN1Cc2cc3ccccc3nc2C1
Show InChI InChI=1S/C12H9N3/c13-8-15-6-10-5-9-3-1-2-4-11(9)14-12(10)7-15/h1-5H,6-7H2
Reactome pathway
n/an/a 1.14E+4n/an/an/an/a7.0n/a
Merck Frosst Centre for Therapeutic Research
Curated by ChEMBL
Assay Description
Effect of 10 mM of GSH on the inhibitory activity against Cathepsin K, at pH 7
J Med Chem 44: 94-104 (2001)
BindingDB Entry DOI: 10.7270/Q2DV1J4R
Cathepsin K
(Homo sapiens (Human))
BDBM50095488
(1,3-Dihydro-pyrrolo[3,4-b]quinoline-2-carbonitrile...)
Show SMILES N#CN1Cc2cc3ccccc3nc2C1
Show InChI InChI=1S/C12H9N3/c13-8-15-6-10-5-9-3-1-2-4-11(9)14-12(10)7-15/h1-5H,6-7H2
Reactome pathway
n/an/a 340n/an/an/an/a5.5n/a
Merck Frosst Centre for Therapeutic Research
Curated by ChEMBL
Assay Description
Inhibition of Cathepsin K at pH 5.5
J Med Chem 44: 94-104 (2001)
BindingDB Entry DOI: 10.7270/Q2DV1J4R
Cathepsin K
(Homo sapiens (Human))
BDBM50095488
(1,3-Dihydro-pyrrolo[3,4-b]quinoline-2-carbonitrile...)
Show SMILES N#CN1Cc2cc3ccccc3nc2C1
Show InChI InChI=1S/C12H9N3/c13-8-15-6-10-5-9-3-1-2-4-11(9)14-12(10)7-15/h1-5H,6-7H2
Reactome pathway
n/an/a 360n/an/an/an/an/an/a
Merck Frosst Centre for Therapeutic Research
Curated by ChEMBL
Assay Description
Inhibitory activity tested against Human Cathepsin K receptor using gelatinase assay
J Med Chem 44: 94-104 (2001)
BindingDB Entry DOI: 10.7270/Q2DV1J4R
Cathepsin K
(Homo sapiens (Human))
BDBM50095488
(1,3-Dihydro-pyrrolo[3,4-b]quinoline-2-carbonitrile...)
Show SMILES N#CN1Cc2cc3ccccc3nc2C1
Show InChI InChI=1S/C12H9N3/c13-8-15-6-10-5-9-3-1-2-4-11(9)14-12(10)7-15/h1-5H,6-7H2
Reactome pathway
n/an/a 370n/an/an/an/an/an/a
Merck Frosst Centre for Therapeutic Research
Curated by ChEMBL
Assay Description
Inhibitory constant of the compound against human cathepsin K
J Med Chem 44: 94-104 (2001)
BindingDB Entry DOI: 10.7270/Q2DV1J4R
Cathepsin K
(Homo sapiens (Human))
BDBM50095488
(1,3-Dihydro-pyrrolo[3,4-b]quinoline-2-carbonitrile...)
Show SMILES N#CN1Cc2cc3ccccc3nc2C1
Show InChI InChI=1S/C12H9N3/c13-8-15-6-10-5-9-3-1-2-4-11(9)14-12(10)7-15/h1-5H,6-7H2
Reactome pathway
n/an/a 370n/an/an/an/an/an/a
Merck Frosst Centre for Therapeutic Research
Curated by ChEMBL
Assay Description
Inhibitory activity tested against Human Cathepsin K using Z-Phe-Arg-pNA as substrate
J Med Chem 44: 94-104 (2001)
BindingDB Entry DOI: 10.7270/Q2DV1J4R
Cathepsin K
(Homo sapiens (Human))
BDBM50095488
(1,3-Dihydro-pyrrolo[3,4-b]quinoline-2-carbonitrile...)
Show SMILES N#CN1Cc2cc3ccccc3nc2C1
Show InChI InChI=1S/C12H9N3/c13-8-15-6-10-5-9-3-1-2-4-11(9)14-12(10)7-15/h1-5H,6-7H2
Reactome pathway
n/an/a 280n/an/an/an/a7.0n/a
Merck Frosst Centre for Therapeutic Research
Curated by ChEMBL
Assay Description
Inhibition of Cathepsin K at pH 7
J Med Chem 44: 94-104 (2001)
BindingDB Entry DOI: 10.7270/Q2DV1J4R
Cathepsin B
(Homo sapiens (Human))
BDBM50095488
(1,3-Dihydro-pyrrolo[3,4-b]quinoline-2-carbonitrile...)
Show SMILES N#CN1Cc2cc3ccccc3nc2C1
Show InChI InChI=1S/C12H9N3/c13-8-15-6-10-5-9-3-1-2-4-11(9)14-12(10)7-15/h1-5H,6-7H2
Reactome pathway
n/an/a 2.30E+3n/an/an/an/an/an/a
Merck Frosst Centre for Therapeutic Research
Curated by ChEMBL
Assay Description
Inhibitory activity tested against Human Cathepsin B using Z-Phe-Arg-pNA as substrate
J Med Chem 44: 94-104 (2001)
BindingDB Entry DOI: 10.7270/Q2DV1J4R
Cathepsin K
(Homo sapiens (Human))
BDBM50095488
(1,3-Dihydro-pyrrolo[3,4-b]quinoline-2-carbonitrile...)
Show SMILES N#CN1Cc2cc3ccccc3nc2C1
Show InChI InChI=1S/C12H9N3/c13-8-15-6-10-5-9-3-1-2-4-11(9)14-12(10)7-15/h1-5H,6-7H2
Reactome pathway
n/an/a 360n/an/an/an/a5.5n/a
Merck Frosst Centre for Therapeutic Research
Curated by ChEMBL
Assay Description
Effect of 10 mM of GSH on the inhibitory activity of compound against Cathepsin K, at pH 5.5
J Med Chem 44: 94-104 (2001)
BindingDB Entry DOI: 10.7270/Q2DV1J4R