null
SMILES: Cn1cc(NC(=O)c2cnn3ccc(nc23)N2C[C@H](N)C[C@@H](F)C2)c(n1)C(F)(F)F
InChI Key: InChIKey=PACUXLHRGQUIQZ-UHFFFAOYSA-N
Activity Spreadsheet -- Enzyme Inhibition Constant Data from BindingDB
Found 2 hits for monomerid = 50095534
Trg + Lig
Ki
nM
ΔG°
kcal/mole
IC50
nM
Kd
nM
EC50/IC50
nM
koff
s-1
kon
M-1s-1
pHTemp
°C
Interleukin-1 receptor-associated kinase 4
(Homo sapiens (Human))
BDBM50095534
(CHEMBL3590516 | US10329294, Example 252)
Show SMILES Cn1cc(NC(=O)c2cnn3ccc(nc23)N2C[C@H](N)C[C@@H](F)C2)c(n1)C(F)(F)F |r|
Show InChI InChI=1S/C9H14N2O2/c1-6-8(13-11-9(6)12)7-2-4-10-5-3-7/h7,10H,2-5H2,1H3,(H,11,12)
Reactome pathway
US Patent
n/an/a 0.800n/an/an/an/an/an/a
Vernalis (R&D) Ltd
Assay Description
The kinase activity of IRAK4 is determined by its ability to catalyze the phosphorylation of a fluorescent polypeptide substrate. The extent of phosp...
Bioorg Med Chem 17: 6590-605 (2009)
BindingDB Entry DOI: 10.7270/Q2V40XJ3
Interleukin-1 receptor-associated kinase 4
(Homo sapiens (Human))
BDBM50095534
(CHEMBL3590516 | US10329294, Example 252)
Show SMILES Cn1cc(NC(=O)c2cnn3ccc(nc23)N2C[C@H](N)C[C@@H](F)C2)c(n1)C(F)(F)F |r|
Show InChI InChI=1S/C9H14N2O2/c1-6-8(13-11-9(6)12)7-2-4-10-5-3-7/h7,10H,2-5H2,1H3,(H,11,12)
Reactome pathway
n/an/a 0.5n/an/an/an/an/an/a
Merck& Co.
Curated by ChEMBL
Assay Description
Inhibition of human IRAK4 assessed as phosphorylation of fluorescent peptide substrate after 30 mins by fluorescent polarization reader
ACS Med Chem Lett 6: 683-8 (2015)
Article DOI: 10.1021/acsmedchemlett.5b00107
BindingDB Entry DOI: 10.7270/Q2QF8VNH