null
SMILES: [O-][N+](=O)c1ccc(CCNCCOc2ccc(cc2)[N+]([O-])=O)cc1
InChI Key: InChIKey=MYUWQXUKSBKSDS-UHFFFAOYSA-N
Activity Spreadsheet -- Enzyme Inhibition Constant Data from BindingDB
Found 2 hits for monomerid = 50095640
Trg + Lig
Ki
nM
ΔG°
kcal/mole
IC50
nM
Kd
nM
EC50/IC50
nM
koff
s-1
kon
M-1s-1
pHTemp
°C
Potassium voltage-gated channel subfamily H member 2
(Homo sapiens (Human))
BDBM50095640
(CHEMBL3590444)
Show SMILES [O-][N+](=O)c1ccc(CCNCCOc2ccc(cc2)[N+]([O-])=O)cc1
Show InChI InChI=1S/C16H17N3O5/c20-18(21)14-3-1-13(2-4-14)9-10-17-11-12-24-16-7-5-15(6-8-16)19(22)23/h1-8,17H,9-12H2
Reactome pathway
47n/an/an/an/an/an/an/an/a
Leiden University
Curated by ChEMBL
Assay Description
Displacement of [3H]dofetilide from human Kv11.1 expressed in HEK293 cell membranes by competitive radioligand displacement assay
J Med Chem 58: 5916-29 (2015)
Article DOI: 10.1021/acs.jmedchem.5b00518
BindingDB Entry DOI: 10.7270/Q2FX7C6V
Potassium voltage-gated channel subfamily H member 2
(Homo sapiens (Human))
BDBM50095640
(CHEMBL3590444)
Show SMILES [O-][N+](=O)c1ccc(CCNCCOc2ccc(cc2)[N+]([O-])=O)cc1
Show InChI InChI=1S/C16H17N3O5/c20-18(21)14-3-1-13(2-4-14)9-10-17-11-12-24-16-7-5-15(6-8-16)19(22)23/h1-8,17H,9-12H2
Reactome pathway
n/an/an/a 53n/an/an/an/an/a
Leiden University
Curated by ChEMBL
Assay Description
Binding affinity to human Kv11.1 expressed in HEK293 cell membranes assessed as binding affinity constant by [3H]dofetilide competition association a...
J Med Chem 58: 5916-29 (2015)
Article DOI: 10.1021/acs.jmedchem.5b00518
BindingDB Entry DOI: 10.7270/Q2FX7C6V