BDBM50095652 CHEMBL3590452
SMILES: CN(CCCCOc1ccc(cc1)[N+]([O-])=O)CCc1ccc(cc1)[N+]([O-])=O
InChI Key: InChIKey=IPLLWIZMHGMEIQ-UHFFFAOYSA-N
Data: 1 KI  1 Kd
Activity Spreadsheet -- Enzyme Inhibition Constant Data from BindingDB
Found 2 hits for monomerid = 50095652
Trg + Lig
Ki
nM
ΔG°
kcal/mole
IC50
nM
Kd
nM
EC50/IC50
nM
koff
s-1
kon
M-1s-1
pHTemp
°C
Potassium voltage-gated channel subfamily H member 2
(Homo sapiens (Human))
BDBM50095652
(CHEMBL3590452)
Show SMILES CN(CCCCOc1ccc(cc1)[N+]([O-])=O)CCc1ccc(cc1)[N+]([O-])=O
Show InChI InChI=1S/C19H23N3O5/c1-20(14-12-16-4-6-17(7-5-16)21(23)24)13-2-3-15-27-19-10-8-18(9-11-19)22(25)26/h4-11H,2-3,12-15H2,1H3
Reactome pathway
1.60n/an/an/an/an/an/an/an/a
Leiden University
Curated by ChEMBL
Assay Description
Displacement of [3H]dofetilide from human Kv11.1 expressed in HEK293 cell membranes by competitive radioligand displacement assay
J Med Chem 58: 5916-29 (2015)
Article DOI: 10.1021/acs.jmedchem.5b00518
BindingDB Entry DOI: 10.7270/Q2FX7C6V
Potassium voltage-gated channel subfamily H member 2
(Homo sapiens (Human))
BDBM50095652
(CHEMBL3590452)
Show SMILES CN(CCCCOc1ccc(cc1)[N+]([O-])=O)CCc1ccc(cc1)[N+]([O-])=O
Show InChI InChI=1S/C19H23N3O5/c1-20(14-12-16-4-6-17(7-5-16)21(23)24)13-2-3-15-27-19-10-8-18(9-11-19)22(25)26/h4-11H,2-3,12-15H2,1H3
Reactome pathway
n/an/an/a 0.730n/an/an/an/an/a
Leiden University
Curated by ChEMBL
Assay Description
Binding affinity to human Kv11.1 expressed in HEK293 cell membranes assessed as binding affinity constant by [3H]dofetilide competition association a...
J Med Chem 58: 5916-29 (2015)
Article DOI: 10.1021/acs.jmedchem.5b00518
BindingDB Entry DOI: 10.7270/Q2FX7C6V