BDBM50095766 CHEMBL3590461
SMILES: CCCCCCCCc1cccc(CCCCCCCC)n1
InChI Key: InChIKey=IARIVDQPXIQGSO-UHFFFAOYSA-N
Data: 1 KI  1 Kd
Activity Spreadsheet -- Enzyme Inhibition Constant Data from BindingDB
Found 2 hits for monomerid = 50095766
Trg + Lig
Ki
nM
ΔG°
kcal/mole
IC50
nM
Kd
nM
EC50/IC50
nM
koff
s-1
kon
M-1s-1
pHTemp
°C
Potassium voltage-gated channel subfamily H member 2
(Homo sapiens (Human))
BDBM50095766
(CHEMBL3590461)
Show SMILES CCCCCCCCc1cccc(CCCCCCCC)n1
Show InChI InChI=1S/C21H37N/c1-3-5-7-9-11-13-16-20-18-15-19-21(22-20)17-14-12-10-8-6-4-2/h15,18-19H,3-14,16-17H2,1-2H3
Reactome pathway
3.69E+4n/an/an/an/an/an/an/an/a
Leiden University
Curated by ChEMBL
Assay Description
Displacement of [3H]dofetilide from human Kv11.1 expressed in HEK293 cell membranes by competitive radioligand displacement assay
J Med Chem 58: 5916-29 (2015)
Article DOI: 10.1021/acs.jmedchem.5b00518
BindingDB Entry DOI: 10.7270/Q2FX7C6V
Potassium voltage-gated channel subfamily H member 2
(Homo sapiens (Human))
BDBM50095766
(CHEMBL3590461)
Show SMILES CCCCCCCCc1cccc(CCCCCCCC)n1
Show InChI InChI=1S/C21H37N/c1-3-5-7-9-11-13-16-20-18-15-19-21(22-20)17-14-12-10-8-6-4-2/h15,18-19H,3-14,16-17H2,1-2H3
Reactome pathway
n/an/an/a 1.91E+5n/an/an/an/an/a
Leiden University
Curated by ChEMBL
Assay Description
Binding affinity to human Kv11.1 expressed in HEK293 cell membranes assessed as binding affinity constant by [3H]dofetilide competition association a...
J Med Chem 58: 5916-29 (2015)
Article DOI: 10.1021/acs.jmedchem.5b00518
BindingDB Entry DOI: 10.7270/Q2FX7C6V