null
SMILES: CN1c2cccnc2N(c2ncccc2C1=O)C(C)(C)C
InChI Key: InChIKey=CNQFYBOQUAUFJV-UHFFFAOYSA-N
Activity Spreadsheet -- Enzyme Inhibition Constant Data from BindingDB
Found 1 hit for monomerid = 50095771
Trg + Lig
Ki
nM
ΔG°
kcal/mole
IC50
nM
Kd
nM
EC50/IC50
nM
koff
s-1
kon
M-1s-1
pHTemp
°C
Reverse transcriptase/RNaseH
(Human immunodeficiency virus 1)
BDBM50095771
(5-tert-Butyl-10-methyl-5,10-dihydro-4,5,6,10-tetra...)
Show SMILES CN1c2cccnc2N(c2ncccc2C1=O)C(C)(C)C
Show InChI InChI=1S/C16H18N4O/c1-16(2,3)20-13-11(7-5-9-17-13)15(21)19(4)12-8-6-10-18-14(12)20/h5-10H,1-4H3
n/an/a 1.10E+4n/an/an/an/an/an/a
Yale University
Curated by ChEMBL
Assay Description
Inhibition of HIV-1 reverse transcriptase at 37 degree Centigrade
J Med Chem 44: 145-54 (2001)
BindingDB Entry DOI: 10.7270/Q2VX0FRX