null
SMILES: CN1c2cccnc2N(CCF)c2ncccc2C1=O
InChI Key: InChIKey=VHWMCYSUONKRJA-UHFFFAOYSA-N
Activity Spreadsheet -- Enzyme Inhibition Constant Data from BindingDB
Found 1 hit for monomerid = 50095773
Trg + Lig
Ki
nM
ΔG°
kcal/mole
IC50
nM
Kd
nM
EC50/IC50
nM
koff
s-1
kon
M-1s-1
pHTemp
°C
Reverse transcriptase/RNaseH
(Human immunodeficiency virus 1)
BDBM50095773
(5-(2-Fluoro-ethyl)-10-methyl-5,10-dihydro-4,5,6,10...)
Show SMILES CN1c2cccnc2N(CCF)c2ncccc2C1=O
Show InChI InChI=1S/C14H13FN4O/c1-18-11-5-3-8-17-13(11)19(9-6-15)12-10(14(18)20)4-2-7-16-12/h2-5,7-8H,6,9H2,1H3
n/an/a 2.90E+3n/an/an/an/an/an/a
Yale University
Curated by ChEMBL
Assay Description
Inhibition of HIV-1 reverse transcriptase at 37 degree Centigrade
J Med Chem 44: 145-54 (2001)
BindingDB Entry DOI: 10.7270/Q2VX0FRX