null
SMILES: CCCCN1C(=O)\C(=C\NCc2cccnc2)C(=O)c2cccc(C)c12
InChI Key: InChIKey=BYVZQVBXRFZWMY-ABLAWYLBSA-N
Activity Spreadsheet -- Enzyme Inhibition Constant Data from BindingDB
Found 2 hits for monomerid = 50095856
Trg + Lig
Ki
nM
ΔG°
kcal/mole
IC50
nM
Kd
nM
EC50/IC50
nM
koff
s-1
kon
M-1s-1
pHTemp
°C
Cannabinoid receptor 1
(Homo sapiens (Human))
BDBM50095856
(CHEMBL3590618)
Show SMILES CCCCN1C(=O)\C(=C\NCc2cccnc2)C(=O)c2cccc(C)c12
Show InChI InChI=1S/C21H34N6O4/c1-2-3-4-5-6-7-8-9-10-11-23-20(30)17-15(28)16(29)21(31-17)27-13-26-14-18(22)24-12-25-19(14)27/h12-13,15-17,21,28-29H,2-11H2,1H3,(H,23,30)(H2,22,24,25)/t15?,16?,17-,21+/m0/s1
NCI pathway
Reactome pathway
n/an/an/an/a>1.00E+4n/an/an/an/a
Zhejiang University
Curated by ChEMBL
Assay Description
Agonist activity at CB1R (unknown origin) CHO cells stably expressing Galpha16 assessed as increase in intracellular calcium level by microplate read...
J Med Chem 58: 5751-69 (2015)
Article DOI: 10.1021/acs.jmedchem.5b00227
BindingDB Entry DOI: 10.7270/Q2Z039X8
Cannabinoid receptor 2
(Homo sapiens (Human))
BDBM50095856
(CHEMBL3590618)
Show SMILES CCCCN1C(=O)\C(=C\NCc2cccnc2)C(=O)c2cccc(C)c12
Show InChI InChI=1S/C21H34N6O4/c1-2-3-4-5-6-7-8-9-10-11-23-20(30)17-15(28)16(29)21(31-17)27-13-26-14-18(22)24-12-25-19(14)27/h12-13,15-17,21,28-29H,2-11H2,1H3,(H,23,30)(H2,22,24,25)/t15?,16?,17-,21+/m0/s1
Reactome pathway
n/an/an/an/a>1.00E+4n/an/an/an/a
Zhejiang University
Curated by ChEMBL
Assay Description
Agonist activity at CB2R (unknown origin) CHO cells stably expressing Galpha16 assessed as increase in intracellular calcium level by microplate read...
J Med Chem 58: 5751-69 (2015)
Article DOI: 10.1021/acs.jmedchem.5b00227
BindingDB Entry DOI: 10.7270/Q2Z039X8