null
SMILES: CCCCCN1C(=O)\C(=C\NC2CCCCC2)C(=O)c2cccc(C)c12
InChI Key: InChIKey=KPBXYHTYRSJTOG-SAONEMICSA-N
Activity Spreadsheet -- Enzyme Inhibition Constant Data from BindingDB
Found 3 hits for monomerid = 50095866
Trg + Lig
Ki
nM
ΔG°
kcal/mole
IC50
nM
Kd
nM
EC50/IC50
nM
koff
s-1
kon
M-1s-1
pHTemp
°C
Cannabinoid receptor 2
(Homo sapiens (Human))
BDBM50095866
(CHEMBL3590608)
Show SMILES CCCCCN1C(=O)\C(=C\NC2CCCCC2)C(=O)c2cccc(C)c12
Show InChI InChI=1S/C20H31N7O5/c1-12(28)22-8-6-4-2-3-5-7-9-23-19(31)16-14(29)15(30)20(32-16)27-11-26-13-17(21)24-10-25-18(13)27/h10-11,14-16,20,29-30H,2-9H2,1H3,(H,22,28)(H,23,31)(H2,21,24,25)/t14?,15?,16-,20+/m0/s1
Reactome pathway
n/an/an/an/a 320n/an/an/an/a
Zhejiang University
Curated by ChEMBL
Assay Description
Agonist activity at CB2R (unknown origin) CHO cells stably expressing Galpha16 assessed as increase in intracellular calcium level by microplate read...
J Med Chem 58: 5751-69 (2015)
Article DOI: 10.1021/acs.jmedchem.5b00227
BindingDB Entry DOI: 10.7270/Q2Z039X8
Cannabinoid receptor 1
(Homo sapiens (Human))
BDBM50095866
(CHEMBL3590608)
Show SMILES CCCCCN1C(=O)\C(=C\NC2CCCCC2)C(=O)c2cccc(C)c12
Show InChI InChI=1S/C20H31N7O5/c1-12(28)22-8-6-4-2-3-5-7-9-23-19(31)16-14(29)15(30)20(32-16)27-11-26-13-17(21)24-10-25-18(13)27/h10-11,14-16,20,29-30H,2-9H2,1H3,(H,22,28)(H,23,31)(H2,21,24,25)/t14?,15?,16-,20+/m0/s1
NCI pathway
Reactome pathway
n/an/an/an/a>1.00E+4n/an/an/an/a
Zhejiang University
Curated by ChEMBL
Assay Description
Agonist activity at CB1R (unknown origin) CHO cells stably expressing Galpha16 assessed as increase in intracellular calcium level by microplate read...
J Med Chem 58: 5751-69 (2015)
Article DOI: 10.1021/acs.jmedchem.5b00227
BindingDB Entry DOI: 10.7270/Q2Z039X8
Cannabinoid receptor 2
(Homo sapiens (Human))
BDBM50095866
(CHEMBL3590608)
Show SMILES CCCCCN1C(=O)\C(=C\NC2CCCCC2)C(=O)c2cccc(C)c12
Show InChI InChI=1S/C20H31N7O5/c1-12(28)22-8-6-4-2-3-5-7-9-23-19(31)16-14(29)15(30)20(32-16)27-11-26-13-17(21)24-10-25-18(13)27/h10-11,14-16,20,29-30H,2-9H2,1H3,(H,22,28)(H,23,31)(H2,21,24,25)/t14?,15?,16-,20+/m0/s1
Reactome pathway
n/an/an/an/a 320n/an/an/an/a
Zhejiang University
Curated by ChEMBL
Assay Description
Agonist activity at CB2R (unknown origin) CHO cells stably expressing Galpha16 assessed as increase in intracellular calcium level by microplate read...
J Med Chem 58: 5751-69 (2015)
Article DOI: 10.1021/acs.jmedchem.5b00227
BindingDB Entry DOI: 10.7270/Q2Z039X8