null
SMILES: CCCCN1C(=O)\C(=C\NC(C)CCC)C(=O)c2cccc(C)c12
InChI Key: InChIKey=IVQYYWYPOLYJOO-GHRIWEEISA-N
Activity Spreadsheet -- Enzyme Inhibition Constant Data from BindingDB
Found 3 hits for monomerid = 50095872
Trg + Lig
Ki
nM
ΔG°
kcal/mole
IC50
nM
Kd
nM
EC50/IC50
nM
koff
s-1
kon
M-1s-1
pHTemp
°C
Cannabinoid receptor 2
(Homo sapiens (Human))
BDBM50095872
(CHEMBL3590635)
Show SMILES CCCCN1C(=O)\C(=C\NC(C)CCC)C(=O)c2cccc(C)c12
Show InChI InChI=1S/C20H28N2O2/c1-5-7-12-22-18-14(3)10-8-11-16(18)19(23)17(20(22)24)13-21-15(4)9-6-2/h8,10-11,13,15,21H,5-7,9,12H2,1-4H3/b17-13+
Reactome pathway
n/an/an/an/a 116n/an/an/an/a
Zhejiang University
Curated by ChEMBL
Assay Description
Agonist activity at CB2R (unknown origin) CHO cells stably expressing Galpha16 assessed as increase in intracellular calcium level by microplate read...
J Med Chem 58: 5751-69 (2015)
Article DOI: 10.1021/acs.jmedchem.5b00227
BindingDB Entry DOI: 10.7270/Q2Z039X8
Cannabinoid receptor 1
(Homo sapiens (Human))
BDBM50095872
(CHEMBL3590635)
Show SMILES CCCCN1C(=O)\C(=C\NC(C)CCC)C(=O)c2cccc(C)c12
Show InChI InChI=1S/C20H28N2O2/c1-5-7-12-22-18-14(3)10-8-11-16(18)19(23)17(20(22)24)13-21-15(4)9-6-2/h8,10-11,13,15,21H,5-7,9,12H2,1-4H3/b17-13+
NCI pathway
Reactome pathway
n/an/an/an/a>1.00E+4n/an/an/an/a
Zhejiang University
Curated by ChEMBL
Assay Description
Agonist activity at CB1R (unknown origin) CHO cells stably expressing Galpha16 assessed as increase in intracellular calcium level by microplate read...
J Med Chem 58: 5751-69 (2015)
Article DOI: 10.1021/acs.jmedchem.5b00227
BindingDB Entry DOI: 10.7270/Q2Z039X8
Cannabinoid receptor 2
(Homo sapiens (Human))
BDBM50095872
(CHEMBL3590635)
Show SMILES CCCCN1C(=O)\C(=C\NC(C)CCC)C(=O)c2cccc(C)c12
Show InChI InChI=1S/C20H28N2O2/c1-5-7-12-22-18-14(3)10-8-11-16(18)19(23)17(20(22)24)13-21-15(4)9-6-2/h8,10-11,13,15,21H,5-7,9,12H2,1-4H3/b17-13+
Reactome pathway
n/an/an/an/a 116n/an/an/an/a
Zhejiang University
Curated by ChEMBL
Assay Description
Agonist activity at CB2R (unknown origin) CHO cells stably expressing Galpha16 assessed as increase in intracellular calcium level by microplate read...
J Med Chem 58: 5751-69 (2015)
Article DOI: 10.1021/acs.jmedchem.5b00227
BindingDB Entry DOI: 10.7270/Q2Z039X8