null
SMILES: CCCCN1C(=O)\C(=C\NC(C)(C)CO)C(=O)c2cccc(C)c12
InChI Key: InChIKey=HJACMUQFFZRWAY-RVDMUPIBSA-N
Activity Spreadsheet -- Enzyme Inhibition Constant Data from BindingDB
Found 3 hits for monomerid = 50095874
Trg + Lig
Ki
nM
ΔG°
kcal/mole
IC50
nM
Kd
nM
EC50/IC50
nM
koff
s-1
kon
M-1s-1
pHTemp
°C
Cannabinoid receptor 2
(Homo sapiens (Human))
BDBM50095874
(CHEMBL3590633)
Show SMILES CCCCN1C(=O)\C(=C\NC(C)(C)CO)C(=O)c2cccc(C)c12
Show InChI InChI=1S/C19H26N2O3/c1-5-6-10-21-16-13(2)8-7-9-14(16)17(23)15(18(21)24)11-20-19(3,4)12-22/h7-9,11,20,22H,5-6,10,12H2,1-4H3/b15-11+
Reactome pathway
n/an/an/an/a 41n/an/an/an/a
Zhejiang University
Curated by ChEMBL
Assay Description
Agonist activity at CB2R (unknown origin) CHO cells stably expressing Galpha16 assessed as increase in intracellular calcium level by microplate read...
J Med Chem 58: 5751-69 (2015)
Article DOI: 10.1021/acs.jmedchem.5b00227
BindingDB Entry DOI: 10.7270/Q2Z039X8
Cannabinoid receptor 1
(Homo sapiens (Human))
BDBM50095874
(CHEMBL3590633)
Show SMILES CCCCN1C(=O)\C(=C\NC(C)(C)CO)C(=O)c2cccc(C)c12
Show InChI InChI=1S/C19H26N2O3/c1-5-6-10-21-16-13(2)8-7-9-14(16)17(23)15(18(21)24)11-20-19(3,4)12-22/h7-9,11,20,22H,5-6,10,12H2,1-4H3/b15-11+
NCI pathway
Reactome pathway
n/an/an/an/a 557n/an/an/an/a
Zhejiang University
Curated by ChEMBL
Assay Description
Agonist activity at CB1R (unknown origin) CHO cells stably expressing Galpha16 assessed as increase in intracellular calcium level by microplate read...
J Med Chem 58: 5751-69 (2015)
Article DOI: 10.1021/acs.jmedchem.5b00227
BindingDB Entry DOI: 10.7270/Q2Z039X8
Cannabinoid receptor 2
(Homo sapiens (Human))
BDBM50095874
(CHEMBL3590633)
Show SMILES CCCCN1C(=O)\C(=C\NC(C)(C)CO)C(=O)c2cccc(C)c12
Show InChI InChI=1S/C19H26N2O3/c1-5-6-10-21-16-13(2)8-7-9-14(16)17(23)15(18(21)24)11-20-19(3,4)12-22/h7-9,11,20,22H,5-6,10,12H2,1-4H3/b15-11+
Reactome pathway
n/an/an/an/a 41n/an/an/an/a
Zhejiang University
Curated by ChEMBL
Assay Description
Agonist activity at CB2R (unknown origin) CHO cells stably expressing Galpha16 assessed as increase in intracellular calcium level by microplate read...
J Med Chem 58: 5751-69 (2015)
Article DOI: 10.1021/acs.jmedchem.5b00227
BindingDB Entry DOI: 10.7270/Q2Z039X8